1H-Benzocycloheptene, 2,4a,5,6,7,8,9,9a-octahydro-3,5,5-trimethyl-9-methylene-, (4aS-cis)-

Kovats' RI, non-polar column, isothermal

Data compiled by: NIST Mass Spectrometry Data Center, William E. Wallace, director

Column type PackedPacked
Active phase SF-96SE-30
Column length (m) 7.3
Carrier gas  He
Substrate  Chromosorb G
Column diameter (mm)
Phase thickness (μm)
Temperature (C) 170.130.
I 1475.31444.
ReferenceAndersen, Bissonette, et al., 1977Andersen and Falcone, 1969
Comment MSDC-RI MSDC-RI

Van Den Dool and Kratz RI, non-polar column, temperature ramp

Data compiled by: NIST Mass Spectrometry Data Center, William E. Wallace, director

Column type CapillaryCapillaryCapillaryCapillaryCapillary
Active phase HP-5MSRTX-1DB-5RTX-1HP-5MS
Column length (m) 30.60.30.60.30.
Carrier gas HeHeHeHeHe
Substrate
Column diameter (mm) 0.250.220.250.220.25
Phase thickness (μm) 0.250.250.250.250.25
Tstart (C) 60.60.50.60.60.
Tend (C) 250.230.250.230.300.
Heat rate (K/min) 2.2.3.2.3.
Initial hold (min) 8.
Final hold (min) 30.35.10.45.
I 1450.1447.1449.1447.1444.
ReferenceBenkaci-Ali, Baaliouamer, et al., 2007Paolini J., Costa J., et al., 2007Yu, Liao, et al., 2007Cavalli, Tomi, et al., 2006Silva-Brandão, Solferini, et al., 2006
Comment MSDC-RI MSDC-RI MSDC-RI MSDC-RI MSDC-RI
Column type CapillaryCapillaryCapillary
Active phase RTX-5DB-5DB-5
Column length (m) 30.30.30.
Carrier gas HeHeHe
Substrate
Column diameter (mm) 0.250.250.25
Phase thickness (μm) 0.250.250.25
Tstart (C) 45.60.60.
Tend (C) 250.240.240.
Heat rate (K/min) 3.3.3.
Initial hold (min) 6.2.2.
Final hold (min)
I 1447.1448.1448.
ReferenceShellie, Marriott, et al., 2003Maia, de Paula, et al., 2000Maia, de Paula, et al., 2000
Comment MSDC-RI MSDC-RI MSDC-RI

Normal alkane RI, polar column, temperature ramp

Data compiled by: NIST Mass Spectrometry Data Center, William E. Wallace, director

Column type CapillaryCapillaryCapillaryCapillaryCapillary
Active phase CP-Wax 52CBHP-InnowaxCP-Wax 52CBCP-Wax 52CBTC-Wax
Column length (m) 30.30.30.30.60.
Carrier gas HeHeHeHe
Substrate
Column diameter (mm) 0.320.250.320.320.25
Phase thickness (μm) 0.250.170.250.25
Tstart (C) 60.60.40.40.80.
Tend (C) 220.210.220.220.240.
Heat rate (K/min) 3.34.4.4.3.
Initial hold (min) 7.3.1.1.5.
Final hold (min) 3.15.
I 1655.1649.1649.1649.1662.
ReferenceHymete, Rohloff, et al., 2006Ferretti, Maggi, et al., 2005Rohloff and Bones, 2005Rohloff and Bones, 2005Shuichi, Masazumi, et al., 1996
Comment MSDC-RI MSDC-RI MSDC-RI MSDC-RI MSDC-RI
Column type CapillaryCapillaryCapillary
Active phase DB-WaxSupelcowax-10Supelcowax-10
Column length (m) 30.30.30.
Carrier gas   He
Substrate
Column diameter (mm) 0.32
Phase thickness (μm)
Tstart (C) 70.50.50.
Tend (C) 200.240.240.
Heat rate (K/min) 4.4.4.
Initial hold (min) 2.2.2.
Final hold (min)  10.10.
I 1649.1649.1649.
ReferenceWyllie, Brophy, et al., 1990Ramaswami, Briscese, et al., 1988Ramaswami, Briscese, et al., 1986
Comment MSDC-RI MSDC-RI MSDC-RI

Normal alkane RI, polar column, custom temperature program

Data compiled by: NIST Mass Spectrometry Data Center, William E. Wallace, director

Column type CapillaryCapillaryCapillaryCapillary
Active phase HP-Innowax FSCHP-Innowax FSCCarbowax 20MHP-Innowax FSC
Column length (m) 60.60. 60.
Carrier gas  He He
Substrate
Column diameter (mm) 0.250.25 0.25
Phase thickness (μm) 0.250.25 0.25
Program 60C(10min) => 4C/min => 220C (10min) => 1C/min => 240C60C(10min) => 4C/min => 220C(10min) => 1C/min => 240Cnot specified60C(10min) => 4C/min => 220C(10min) => 1C/min => 240C
I 1661.1661.1704.1661.
ReferenceTabanca, Demirci, et al., 2006Tabanca, Demirci, et al., 2005Vinogradov, 2004Bagci, Baser, et al., 1999
Comment MSDC-RI MSDC-RI MSDC-RI MSDC-RI

References

Andersen, Bissonette, et al., 1977
Andersen, N.H.; Bissonette, P.; Liu, C.-B.; Shunk, B.; Ohta, Y.; Tseng, C.-L.W.; Moore, A.; Huneck, S., Sesquiterpenes of nine European liverworts from the genera, Anastrepta, Bazzania, Jungermannia, Lepidozia, and Scapania, Phytochemistry, 1977, 16, 11, 1731-1751, https://doi.org/10.1016/0031-9422(71)85081-1 . [all data]

Andersen and Falcone, 1969
Andersen, N.H.; Falcone, M.S., The identification of sesquiterpene hydrocarbons from gas-liquid chromatography retention data, J. Chromatogr., 1969, 44, 52-59, https://doi.org/10.1016/S0021-9673(01)92497-5 . [all data]