cis-Bicyclo[4.3.0]nona-3,7-diene

Condensed phase thermochemistry data

Data compiled by: Hussein Y. Afeefy, Joel F. Liebman, and Stephen E. Stein

Quantity Value Units Method Reference Comment
Δfliquid15.36 ± 0.26kcal/molCcbKozina, Timofeeva, et al., 1972
Quantity Value Units Method Reference Comment
Δcliquid-1271.72 ± 0.24kcal/molCcbKozina, Timofeeva, et al., 1972Corresponding Δfliquid = 15.37 kcal/mol (simple calculation by NIST; no Washburn corrections)

References

Kozina, Timofeeva, et al., 1972
Kozina, M.P.; Timofeeva, L.P.; Pimenova, S.M.; Aleshina, V.A.; Belikova, N.A.; Bobyleva, A.A.; Plate, A.F., Enthalpies of combustion and of formation of 4-vinylcyclohexene and of certain bicyclic compounds, Russ. J. Phys. Chem. (Engl. Transl.), 1972, 46, 1689-1690. [all data]