p-Dimethylamino-m-nitroazobenzene

Phase change data

Data compiled by: William E. Acree, Jr., James S. Chickos

Enthalpy of sublimation

ΔsubH (kJ/mol) Temperature (K) Method Reference Comment
133.9 ± 3.8400.MEGreen and Jones, 1967Based on data from 388. - 412. K.
133.1 ± 3.8401.TEGreen and Jones, 1967Based on data from 392. - 410. K. See also Stephenson and Malanowski, 1987.

References

Green and Jones, 1967
Green, H.S.; Jones, F., Vapour pressures, heats of sublimation and degrees of association of some azo compounds in the vapour phase, Trans. Faraday Soc., 1967, 63, 1612, https://doi.org/10.1039/tf9676301612 . [all data]

Stephenson and Malanowski, 1987
Stephenson, Richard M.; Malanowski, Stanislaw, Handbook of the Thermodynamics of Organic Compounds, 1987, https://doi.org/10.1007/978-94-009-3173-2 . [all data]