2,2-Dimethyl-1-phenyl-1-propanol

Phase change data

Data compiled as indicated in comments:
BS - Robert L. Brown and Stephen E. Stein
TRC - Thermodynamics Research Center, NIST Boulder Laboratories, Chris Muzny director

Quantity Value Units Method Reference Comment
Tfus318.KN/ABrewster, Patterson, et al., 1954Uncertainty assigned by TRC = 2. K; TRC
Tfus323.65KN/AZeiss and Tsutsui, 1953Uncertainty assigned by TRC = 2. K; TRC

Reduced pressure boiling point

Tboil (K) Pressure (bar) Reference Comment
363.20.007Aldrich Chemical Company Inc., 1990BS

In addition to the Thermodynamics Research Center (TRC) data available from this site, much more physical and chemical property data is available from the following TRC products:

References

Brewster, Patterson, et al., 1954
Brewster, J.H.; Patterson, J.W.; Fidler, D.A., Reductions at Metal Surfaces III. Clemensen Reduction of Some Sterically- hindered Ketones, J. Am. Chem. Soc., 1954, 76, 6368. [all data]

Zeiss and Tsutsui, 1953
Zeiss, H.H.; Tsutsui, M., The Carbon-Oxygen Absorption Band in the Infrared Spectra of Alcohols, J. Am. Chem. Soc., 1953, 75, 897. [all data]

Aldrich Chemical Company Inc., 1990
Aldrich Chemical Company Inc., Catalog Handbook of Fine Chemicals, Aldrich Chemical Company, Inc., Milwaukee WI, 1990, 1. [all data]