C8H7F3O2S

Reaction thermochemistry data

Data compiled by: John E. Bartmess

Individual Reactions

C8H6F3O2S- + Hydrogen cation = C8H7F3O2S

By formula: C8H6F3O2S- + H+ = C8H7F3O2S

Quantity Value Units Method Reference Comment
Δr1454. ± 8.8kJ/molG+TSTaft and Topsom, 1987gas phase; value altered from reference due to change in acidity scale
Quantity Value Units Method Reference Comment
Δr1425. ± 8.4kJ/molIMRETaft and Topsom, 1987gas phase; value altered from reference due to change in acidity scale

Gas phase ion energetics data

Data compiled by: John E. Bartmess

De-protonation reactions

C8H6F3O2S- + Hydrogen cation = C8H7F3O2S

By formula: C8H6F3O2S- + H+ = C8H7F3O2S

Quantity Value Units Method Reference Comment
Δr1454. ± 8.8kJ/molG+TSTaft and Topsom, 1987gas phase; value altered from reference due to change in acidity scale
Quantity Value Units Method Reference Comment
Δr1425. ± 8.4kJ/molIMRETaft and Topsom, 1987gas phase; value altered from reference due to change in acidity scale

References

Taft and Topsom, 1987
Taft, R.W.; Topsom, R.D., The Nature and Analysis of Substituent Effects, Prog. Phys. Org. Chem., 1987, 16, 1. [all data]