Perchloric acid, 1,2,2-trifluoro-1-chloro-2-bromoethyl ester

Phase change data

Data compiled by: William E. Acree, Jr., James S. Chickos

Enthalpy of vaporization

ΔvapH (kJ/mol) Temperature (K) Method Reference Comment
42.5283.AStephenson and Malanowski, 1987Based on data from 273. - 294. K. See also Schack, Pilipovich, et al., 1973.

References

Stephenson and Malanowski, 1987
Stephenson, Richard M.; Malanowski, Stanislaw, Handbook of the Thermodynamics of Organic Compounds, 1987, https://doi.org/10.1007/978-94-009-3173-2 . [all data]

Schack, Pilipovich, et al., 1973
Schack, Carl J.; Pilipovich, Don; Hon, John F., Halogen perchlorates. Additions to perhaloolefins, Inorg. Chem., 1973, 12, 4, 897-900, https://doi.org/10.1021/ic50122a038 . [all data]