1,1-dichloro-3,3,3-trifluoro-2-methyl-1-propene

Phase change data

Data compiled by: Thermodynamics Research Center, NIST Boulder Laboratories, Chris Muzny director

Quantity Value Units Method Reference Comment
Tboil361.6KN/AHenne, Shepard, et al., 1950Uncertainty assigned by TRC = 1.5 K

In addition to the Thermodynamics Research Center (TRC) data available from this site, much more physical and chemical property data is available from the following TRC products:

References

Henne, Shepard, et al., 1950
Henne, A.L.; Shepard, J.W.; Young, E.J., J. Am. Chem. Soc., 1950, 72, 3577. [all data]