1-Chloro-3,3,3-trifluoro-2-methylpropene

Phase change data

Data compiled as indicated in comments:
BS - Robert L. Brown and Stephen E. Stein
TRC - Thermodynamics Research Center, NIST Boulder Laboratories, Chris Muzny director

Quantity Value Units Method Reference Comment
Tboil319.KN/APCR Inc., 1990BS
Tboil319.6KN/AHenne, Shepard, et al., 1950Uncertainty assigned by TRC = 2. K; TRC
Quantity Value Units Method Reference Comment
Tfus152.9KN/AHenne, Shepard, et al., 1950Uncertainty assigned by TRC = 3. K; TRC

In addition to the Thermodynamics Research Center (TRC) data available from this site, much more physical and chemical property data is available from the following TRC products:

References

PCR Inc., 1990
PCR Inc., Research Chemicals Catalog 1990-1991, PCR Inc., Gainesville, FL, 1990, 1. [all data]

Henne, Shepard, et al., 1950
Henne, A.L.; Shepard, J.W.; Young, E.J., J. Am. Chem. Soc., 1950, 72, 3577. [all data]