Tartronic acid, 3TMS derivative

Van Den Dool and Kratz RI, non-polar column, temperature ramp

Data compiled by: NIST Mass Spectrometry Data Center, William E. Wallace, director

Column type Capillary
Active phase SE-52
Column length (m) 25.
Carrier gas He
Substrate
Column diameter (mm) 0.32
Phase thickness (μm) 0.52
Tstart (C) 70.
Tend (C) 270.
Heat rate (K/min) 5.
Initial hold (min)
Final hold (min)
I 1407.
ReferenceLefevere, Verhaeghe, et al., 1989
Comment MSDC-RI

Kovats' RI, non-polar column, isothermal

Data compiled by: NIST Mass Spectrometry Data Center, William E. Wallace, director

Column type Packed
Active phase OV-1
Column length (m) 2.
Carrier gas N2
Substrate Chromosorb G (100-120 mesh)
Column diameter (mm)
Phase thickness (μm)
Temperature (C) 160.
I 1386.
ReferencePetersson, 1977
Comment MSDC-RI

Normal alkane RI, non-polar column, temperature ramp

Data compiled by: NIST Mass Spectrometry Data Center, William E. Wallace, director

Column type Packed
Active phase OV-1
Column length (m) 2.
Carrier gas Helium
Substrate Chromosorb W HP
Column diameter (mm)
Phase thickness (μm)
Tstart (C) 90.
Tend (C) 270.
Heat rate (K/min) 5.
Initial hold (min)
Final hold (min)
I 1394.
ReferenceMamer and Tjoa, 1973
Comment MSDC-RI

References

Lefevere, Verhaeghe, et al., 1989
Lefevere, M.F.; Verhaeghe, B.J.; Declerck, D.H.; Van Bocxlaer, J.F.; De Leenheer, A.P.; De Sagher, R.M., Metabolic Profiling of Urinary Organic Acids by Single and Multicolumn Capillary Gas Chromatography, J. Chromatogr. Sci., 1989, 27, 1, 23-29, https://doi.org/10.1093/chromsci/27.1.23 . [all data]