Cyclohexanol, 2-methyl-5-(1-methylethenyl)-, (1α,2β,5α)-

Kovats' RI, non-polar column, isothermal

View large format table.

Column type Active phase Temperature (C) I Reference Comment
CapillarySE-30100.1181.5Tudor, 199740. m/0.35 mm/0.35 μm
PackedSE-30160.1208.Hedin, Thompson, et al., 1972N2, Chromosorb W; Column length: 6.145 m

Van Den Dool and Kratz RI, non-polar column, temperature ramp

View large format table.

Column type Active phase I Reference Comment
CapillaryHP-51200.Flamini, Tebano, et al., 200630. m/0.25 mm/0.25 μm, N2, 60. C @ 10. min, 5. K/min; Tend: 220. C
CapillaryMega 5MS1182.Verzera, Trozzi, et al., 200530. m/0.25 mm/0.25 μm, He, 40. C @ 2. min, 3. K/min; Tend: 240. C
CapillaryBP-11178.Baldovini, Ristorcelli, et al., 200050. m/0.22 mm/0.25 μm, 2. K/min, 220. C @ 20. min; Tstart: 60. C
CapillaryMega 5MS1181.Verzera, Trozzi, et al., 200030. m/0.25 mm/0.25 μm, He, 40. C @ 2. min, 3. K/min; Tend: 240. C

Van Den Dool and Kratz RI, polar column, temperature ramp

View large format table.

Column type Active phase I Reference Comment
CapillaryCarbowax 20M1698.Verzera, Campisi, et al., 200560. m/0.25 mm/0.25 μm, He, 45. C @ 0.17 min, 2. K/min; Tend: 250. C
CapillaryMegawax1702.Verzera, Trozzi, et al., 200530. m/0.25 mm/0.25 μm, He, 40. C @ 6. min, 2. K/min, 220. C @ 10. min
CapillaryCP-Wax 52CB1698.Verzera, Campisi, et al., 200160. m/0.25 mm/0.25 μm, He, 45. C @ 0.17 min, 2. K/min; Tend: 250. C
CapillaryBP-201750.Baldovini, Ristorcelli, et al., 200050. m/0.22 mm/0.25 μm, 2. K/min, 220. C @ 20. min; Tstart: 60. C

Normal alkane RI, non-polar column, temperature ramp

View large format table.

Column type Active phase I Reference Comment
CapillaryRTX-5 MS1195.Hudaib and Aburjai, 200730. m/0.25 mm/0.25 μm, He, 3. K/min; Tstart: 45. C; Tend: 210. C
CapillaryDB-51205.Smelcerovic, Spiteller, et al., 200730. m/0.25 mm/0.25 μm, He, 10. K/min, 320. C @ 4. min; Tstart: 60. C
Capillary5 % Phenyl methyl siloxane1169.Marongiu, Piras, et al., 200630. m/0.25 mm/0.25 μm, Helium, 3. K/min, 280. C @ 30. min; Tstart: 60. C
CapillaryDB-51190.Nickavar B., Kamalinejad M., et al., 200630. m/0.25 mm/0.25 μm, 50. C @ 0.5 min, 2.5 K/min; Tend: 265. C
CapillaryHP-51206.Wang, Yang, et al., 200630. m/0.25 mm/0.25 μm, He, 60. C @ 2. min, 10. K/min, 250. C @ 10. min
CapillaryDB-51190.Khayyat and Karimi, 2005He, 3. K/min; Column length: 30. m; Column diameter: 0.32 mm; Tstart: 60. C; Tend: 240. C
CapillaryZB-51208.Jürgens and Dötterl, 200460. m/0.25 mm/0.25 μm, He, 40. C @ 4.6 min, 6. K/min, 260. C @ 1. min
CapillaryNB-301188.Orav, Stulova, et al., 200450. m/0.2 mm/0.25 μm, He, 2. K/min; Tstart: 50. C; Tend: 250. C
CapillaryDB-51192.Tellez, Khan, et al., 200430. m/0.25 mm/0.25 μm, He, 3. K/min; Tstart: 60. C; Tend: 240. C
CapillaryDB-51206.Edris, Shalaby, et al., 2003He, 3. K/min; Column length: 60. m; Column diameter: 0.32 mm; Tstart: 50. C; Tend: 220. C
CapillaryRSL-2001190.Jirovetz, Buchbauer, et al., 200330. m/0.25 mm/0.25 μm, H2, 40. C @ 2. min, 6. K/min, 280. C @ 10. min
CapillaryHP-51195.Gallori, Flamini, et al., 200130. m/0.25 mm/0.25 μm, N2, 60. C @ 10. min, 5. K/min; Tend: 220. C
CapillaryRSL-2001190.Jirovetz, Puschmann, et al., 200060. m/0.32 mm/0.25 μm, H2, 6. K/min; Tstart: 40. C; Tend: 250. C
CapillaryOV-1011196.Menon, Chacko, et al., 1999N2, 1. K/min, 200. C @ 20. min; Column length: 50. m; Column diameter: 0.2 mm; Tstart: 80. C
CapillaryOV-1011191.Tropnikova, Zenkevich, et al., 1999Nitrogen, 60. C @ 0. min, 4. K/min, 220. C @ 0. min; Column length: 25. m; Column diameter: 0.20 mm
CapillaryMethyl Silicone1188.Gopalakrishnan, Menon, et al., 199350. m/0.25 mm/0.17 μm, N2, 2. K/min; Tstart: 80. C; Tend: 200. C
CapillaryMethyl Silicone1187.Gopalakrishnan, Menon, et al., 199350. m/0.25 mm/0.17 μm, N2, 3. K/min; Tstart: 80. C; Tend: 200. C
CapillaryMethyl Silicone1208.Gopalakrishnan, Menon, et al., 199350. m/0.25 mm/0.17 μm, N2, 2. K/min; Tstart: 80. C; Tend: 200. C
CapillaryMethyl Silicone1199.Gopalakrishnan, Menon, et al., 199350. m/0.25 mm/0.17 μm, N2, 3. K/min; Tstart: 80. C; Tend: 200. C
CapillaryOV-1011181.Yang and Sugisawa, 1990N2, 2. K/min; Column length: 50. m; Column diameter: 0.25 mm; Tstart: 80. C; Tend: 200. C
CapillaryOV-1011183.Yang and Sugisawa, 1990N2, 2. K/min; Column length: 50. m; Column diameter: 0.25 mm; Tstart: 80. C; Tend: 200. C
CapillaryOV-1011181.Sugisawa, Yang, et al., 1989N2, 2. K/min; Column length: 50. m; Column diameter: 0.25 mm; Tstart: 80. C; Tend: 200. C
CapillaryOV-1011182.Sugisawa, Yang, et al., 1989N2, 2. K/min; Column length: 50. m; Column diameter: 0.25 mm; Tstart: 80. C; Tend: 200. C

Normal alkane RI, non-polar column, custom temperature program

View large format table.

Column type Active phase I Reference Comment
CapillaryHP-5 MS1177.Formisano, Rigano, et al., 200730. m/0.25 mm/0.25 μm, Helium; Program: 40 0C (5 min) 2 0C/min -> 250 0C (15 min) 10 0C/min -> 270 0C
CapillaryBPX-51226.Koutsoudaki, Krsek, et al., 200530. m/0.32 mm/0.5 μm, He; Program: 60C(1min) => 3.5C/min => 180C => 20C/min => 280C(2min)
CapillarySE-301212.Vinogradov, 2004Program: not specified
CapillaryCP Sil 8 CB1192.Mockute and Judzentiene, 200350. m/0.32 mm/0.25 μm, He; Program: 70C(5min) => 3C/min => 100C (1min) => 25C/min => 250C (10min)
CapillaryPolydimethyl siloxanes1183.Zenkevich, 1997Program: not specified
Capillary5 % Phenyl methyl siloxane1191.Sagrero-Nieves and Bartley, 1995Program: not specified
CapillaryOV-11174.De Pooter and Schamp, 198735. m/0.50 mm/1.5 μm; Program: not specified
CapillaryOV-11175.De Pooter and Schamp, 198735. m/0.50 mm/1.5 μm; Program: not specified
CapillaryOV-1011188.Shibamoto, 1987Program: not specified
PackedOV-1011177.Swigar and Silverstein, 1981N2, Chromosorb G 60-80mesh DMCS; Column length: 2.5 m; Program: not specified
PackedOV-1011180.Swigar and Silverstein, 1981N2, Chromosorb G 60-80mesh DMCS; Column length: 2.5 m; Program: not specified

Normal alkane RI, polar column, temperature ramp

View large format table.

Column type Active phase I Reference Comment
CapillaryHP-Innowax1755.Formisano, Rigano, et al., 200730. m/0.25 mm/0.25 μm, Helium, 40. C @ 5. min, 2. K/min; Tend: 250. C
CapillaryDB-Wax1720.Lee, Umano, et al., 200530. m/0.25 mm/0.25 μm, He, 3. K/min, 180. C @ 40. min; Tstart: 50. C

Normal alkane RI, polar column, custom temperature program

View large format table.

Column type Active phase I Reference Comment
CapillaryCarbowax 20M1713.Hudaib and Aburjai, 200730. m/0.25 mm/0.25 μm, He; Program: not specified
CapillaryCarbowax 20M1698.Editorial paper, 2005Program: not specified
CapillaryCarbowax 20M1713.Editorial paper, 2005Program: not specified
CapillaryCarbowax 20M1713.Shibamoto, 1987Program: not specified

References

Tudor, 1997
Tudor, E., Temperature dependence of the retention index for perfumery compounds on a SE-30 glass capillary column. I. Linear equations, J. Chromatogr. A, 1997, 779, 1-2, 287-297, https://doi.org/10.1016/S0021-9673(97)00453-6 . [all data]

Hedin, Thompson, et al., 1972
Hedin, P.A.; Thompson, A.C.; Gueldner, R.C., Application of a Sequential Reduction Regimen to Fractionation of Essential Oils, Anal. Chem., 1972, 44, 7, 1254-1257, https://doi.org/10.1021/ac60315a030 . [all data]

Flamini, Tebano, et al., 2006
Flamini, G.; Tebano, M.; Cioni, P.L.; Bagci, Y.; Dural, H.; Ertugrul, K.; Uysal, T.; Savran, A., A multivariate statistical approach to Centaurea classification using essential oil composition data of some species from Turkey, Pl. Syst. Evol., 2006, 261, 1-4, 217-228, https://doi.org/10.1007/s00606-006-0448-3 . [all data]

Verzera, Trozzi, et al., 2005
Verzera, A.; Trozzi, A.; Zappala, M.; Condurso, C.; Cotroneo, A., Essential Oil Composition of Citrus meyerii Y. Tan. and Citrus medica L. cv. Diamante and Their Lemon Hybrids, J. Agric. Food Chem., 2005, 53, 12, 4890-4894, https://doi.org/10.1021/jf047879c . [all data]

Baldovini, Ristorcelli, et al., 2000
Baldovini, N.; Ristorcelli, D.; Tomi, F.; Casanova, J., Infraspecific variability of the essential oil of Calamintha nepeta from Corsica (France), Flavour Fragr. J., 2000, 15, 1, 50-54, https://doi.org/10.1002/(SICI)1099-1026(200001/02)15:1<50::AID-FFJ871>3.0.CO;2-F . [all data]

Verzera, Trozzi, et al., 2000
Verzera, A.; Trozzi, A.; Cotroneo, A.; Lorenzo, D.; Dellacassa, E., Uruguayan essential oil. 12. Composition of Nova and Satsuma mandarin oils, J. Agric. Food Chem., 2000, 48, 7, 2903-2909, https://doi.org/10.1021/jf990734z . [all data]

Verzera, Campisi, et al., 2005
Verzera, A.; Campisi, S.; Zappalá, M., SUPELCO. Using SPME-GC-MS to characterize volatile components of honey as indicators of botanical origin, 2005, retrieved from http://www.sigmaaldrich.com/Brands/SupelcoHome/TheReporter.html. [all data]

Verzera, Campisi, et al., 2001
Verzera, A.; Campisi, S.; Zappalá, M.; Bonaccorsi, I., SPME-GC-MS analysis of honey volatile components for the characterization of different floral origin, Am. Lab. Fairfield Conn., 2001, 33, 15, 18-21. [all data]

Hudaib and Aburjai, 2007
Hudaib, M.; Aburjai, T., Volatile components of Thymus vulgaris L. from wild-growing and cultivated plants in Jordan, Flavour Fragr. J., 2007, 22, 4, 322-327, https://doi.org/10.1002/ffj.1800 . [all data]

Smelcerovic, Spiteller, et al., 2007
Smelcerovic, A.; Spiteller, M.; Ligon, A.P.; Smelcerovic, Z.; Raabe, N., Essential oil composition of Hypericum L. species from Southeastern Serbia and their chemotaxonomy, Biochem. Syst. Ecol., 2007, 35, 2, 99-113, https://doi.org/10.1016/j.bse.2006.09.012 . [all data]

Marongiu, Piras, et al., 2006
Marongiu, B.; Piras, A.; Porcedda, S.; Tuveri, E.; Maxia, A., Isolation of Seseli bocconi Guss. volatile oil by supercritical carbon dioxide extraction, Natural Product Research, 2006, 20, 9, 820-826, https://doi.org/10.1080/14786410500364684 . [all data]

Nickavar B., Kamalinejad M., et al., 2006
Nickavar B.; Kamalinejad M.; Mohandesi S., Comparison of the components of the essential oils from leaves and fruits of Grammosciadium platycarpum, Chem. Nat. Compd. (Engl. Transl.), 2006, 42, 6, 686-688, https://doi.org/10.1007/s10600-006-0252-x . [all data]

Wang, Yang, et al., 2006
Wang, Q.; Yang, Y.; Zhao, X.; Zhu, B.; Nan, P.; Zhao, J.; Wang, L.; Chen, F.; Liu, Z.; Zhong, Y., Chemical variation in the essential oil of Ephedra sinica from Northeastern China, Food Chem., 2006, 98, 1, 52-58, https://doi.org/10.1016/j.foodchem.2005.04.033 . [all data]

Khayyat and Karimi, 2005
Khayyat, M.H.; Karimi, H., Composition of the volatile oils of three different species of Artemisia, Iranian Journal of Pharmaceutical Sciences, 2005, 1, 1, 29-32. [all data]

Jürgens and Dötterl, 2004
Jürgens, A.; Dötterl, S., Chemical composition of anther volatiles in Ranunculaceae: genera-specific profiles in Aemone, Aquilegia, Caltha, Pulsatilla, Ranunculus, and Trollius species, American Journal of Botany, 2004, 91, 12, 1969-1980, https://doi.org/10.3732/ajb.91.12.1969 . [all data]

Orav, Stulova, et al., 2004
Orav, A.; Stulova, I.; Kailas, T.; Müürisepp, M., Effect of storage on the essential oil composition of piper nigrum L. fruits of different ripening states, J. Agric. Food Chem., 2004, 52, 9, 2582-2586, https://doi.org/10.1021/jf030635s . [all data]

Tellez, Khan, et al., 2004
Tellez, M.R.; Khan, I.A.; Schaneberg, B.T.; Crockett, S.L.; Rimando, A.M.; Kobaisy, M., Steam distillation-solid-phase microextraction for the detection of Ephedra sinica in herbal preparations, J. Chromatogr. A, 2004, 1025, 1, 51-56, https://doi.org/10.1016/S0021-9673(03)01035-5 . [all data]

Edris, Shalaby, et al., 2003
Edris, A.E.; Shalaby, A.S.; Fadel, H.M.; Abdel-Wahab, M.A., Evaluation of a chemotype of spearmint (Mentha spicata L.) grown in Siwa Oasis, Egypt, Eur. Food Res. Technol., 2003, 218, 1, 74-78, https://doi.org/10.1007/s00217-003-0802-4 . [all data]

Jirovetz, Buchbauer, et al., 2003
Jirovetz, L.; Buchbauer, G.; Stoyanova, A.S.; Georgiev, E.V.; Damianova, S.T., Composition, quality control, and antimicrobial activity of the essential oil of long-time stored dill (Anethum graveolens L.) seeds from Bulgaria, J. Agric. Food Chem., 2003, 51, 13, 3854-3857, https://doi.org/10.1021/jf030004y . [all data]

Gallori, Flamini, et al., 2001
Gallori, S.; Flamini, G.; Bilia, A.R.; Morelli, I.; Landini, A.; Vincieri, F.F., Chemical composition of some traditional herbal drug preparations: essential oil and aromatic water of costmary (Balsamita suaveolens Pers.), J. Agric. Food Chem., 2001, 49, 12, 5907-5910, https://doi.org/10.1021/jf0107656 . [all data]

Jirovetz, Puschmann, et al., 2000
Jirovetz, L.; Puschmann, C.; Stojanova, A.; Metodiev, S.; Buchbauer, G., Analysis of the essential oil volatiles of Douglas fir (Pseudotsuga menziesii) from Bulgaria, Flavour Fragr. J., 2000, 15, 6, 434-437, https://doi.org/10.1002/1099-1026(200011/12)15:6<434::AID-FFJ935>3.0.CO;2-0 . [all data]

Menon, Chacko, et al., 1999
Menon, A.N.; Chacko, S.; Narayanan, C.S., Free and glycosidically bound volatiles of cardamom (Eletteria cardamomum Maton var. miniscula Burkill), Flavour Fragr. J., 1999, 14, 1, 65-68, https://doi.org/10.1002/(SICI)1099-1026(199901/02)14:1<65::AID-FFJ789>3.0.CO;2-A . [all data]

Tropnikova, Zenkevich, et al., 1999
Tropnikova, I.V.; Zenkevich, I.G.; Budantsev, A.L., Composition of Essential Oil Nepeta cataria L. var. Citriodora Beck and Features of its Determination, Rastit. Resursy (Rus.), 1999, 2, 64-69. [all data]

Gopalakrishnan, Menon, et al., 1993
Gopalakrishnan, M.; Menon, N.; Padmakumari, K.P.; Jayalekshmy, A.; Narayanan, C.S., GC Analysis and Odor Profiles of Four New Indian Genotypes of Piper nigrum L., J. Essent. Oil Res., 1993, 5, 3, 247-253, https://doi.org/10.1080/10412905.1993.9698217 . [all data]

Yang and Sugisawa, 1990
Yang, R.; Sugisawa, H., Citrus Suachi Hort. ex Shirai. Volatile components in Sudachi (Citrus Sudachi Hort. ex Shirai) juice, Nippon Shokuhin Kogyo Gakkaishi, 1990, 37, 12, 946-952, https://doi.org/10.3136/nskkk1962.37.12_946 . [all data]

Sugisawa, Yang, et al., 1989
Sugisawa, H.; Yang, R.H.; Kawabata, C.; Tamura, H., Volatile constituents in the peel oil of sudachi (Citrus sudachi), Agric. Biol. Chem., 1989, 53, 6, 1721-1723, https://doi.org/10.1271/bbb1961.53.1721 . [all data]

Formisano, Rigano, et al., 2007
Formisano, C.; Rigano, D.; Napolitano, F.; Senatore, F.; Arnold, N.A.; Piozzi, F.; Rosselli, S., Volatile constituents of Calamintha ariganifolia Boiss. growing wild in Lebanon, Natural Product Communications, 2007, 2, 12, 1253-1256. [all data]

Koutsoudaki, Krsek, et al., 2005
Koutsoudaki, C.; Krsek, M.; Rodger, A., Chemical composition and antibacterial activity of the essential oil and the gum of pistacia lentiscus Var. chia, J. Agric. Food Chem., 2005, 53, 20, 7681-7685, https://doi.org/10.1021/jf050639s . [all data]

Vinogradov, 2004
Vinogradov, B.A., Production, composition, properties and application of essential oils, 2004, retrieved from http://viness.narod.ru. [all data]

Mockute and Judzentiene, 2003
Mockute, D.; Judzentiene, A., The myrtenol chemotype of essential oil of Tanacetum vulgare L. var. vulgare (tansy) growing wild in the Vilnius region, Chemija, 2003, 14, 2, 103-107. [all data]

Zenkevich, 1997
Zenkevich, I.G., Analytical Parameters of Components of Essential Oils for their Chromatographic and Chromato-Spectral Identificaiton. Oxsigenated derivatives of Mono- and Sesquiterpene Hydrocarbons, Rastit, Resursy (Rus.), 1997, 33, 1, 16-28. [all data]

Sagrero-Nieves and Bartley, 1995
Sagrero-Nieves, L.; Bartley, J.P., Volatile Constituents from the Leaves of Chenopodium ambrosioides L., J. Essent. Oil Res., 1995, 7, 2, 221-223, https://doi.org/10.1080/10412905.1995.9698506 . [all data]

De Pooter and Schamp, 1987
De Pooter, H.L.; Schamp, N.M., The Essential Oil of Mentha X villosa nm. alopecuroides, Flavour Fragr. J., 1987, 2, 4, 163-165, https://doi.org/10.1002/ffj.2730020405 . [all data]

Shibamoto, 1987
Shibamoto, T., Retention Indices in Essential Oil Analysis in Capillary Gas Chromatography in Essential Oil Analysis, Sandra, P.; Bicchi, C., ed(s)., Hutchig Verlag, Heidelberg, New York, 1987, 259-274. [all data]

Swigar and Silverstein, 1981
Swigar, A.A.; Silverstein, R.M., Monoterpenes, Aldrich Chemical Company, Milwaukee, WI, USA, 1981, 130. [all data]

Lee, Umano, et al., 2005
Lee, S.-J.; Umano, K.; Shibamoto, T.; Lee, K.-G., Identification of volatile components in basil (Ocimum basilicum L.) and thyme leaves (Thymus vulgaris L.) and their antioxidant properties, Food Chem., 2005, 91, 1, 131-137, https://doi.org/10.1016/j.foodchem.2004.05.056 . [all data]

Editorial paper, 2005
Editorial paper, Solid Phase Microextraction (SPME) Application Guide, The Reporter Europe (Supelco), 2005, 16, 5, 12-12. [all data]