5,9-Undecadien-2-one, 6,10-dimethyl-, (E)-

Van Den Dool and Kratz RI, non-polar column, custom temperature program

Data compiled by: NIST Mass Spectrometry Data Center, William E. Wallace, director

Column type CapillaryCapillaryCapillaryCapillaryCapillary
Active phase HP-5MSVF-5MSVF-5MSCP-Sil5 CB MSDB-1
Column length (m) 30.30.30.60.30.
Carrier gas HeHeHeHeHe
Substrate
Column diameter (mm) 0.250.250.250.320.32
Phase thickness (μm) 0.250.250.250.250.1
Program 60C (1 min) => 5 C/min => 210C => 10 C/min => 280C (15 min)40C(2min) => 5C/min => 200C (2min) => 30C/min => 260C40C(2min) => 5C/min => 200C (2min) => 30C/min => 260C40C(1min) => 25C/min => 120C => 2C/min => 190C => 25C/min => 250C (5min)40C(5min) => 20C/min => 100C => 2C/min => 160C => 40C/min => 250C (5min)
I 1451.1487.1437.1427.11423.0
ReferenceAndriamaharavo, 2014Carasek and Pawliszyn, 2006Carasek and Pawliszyn, 2006Helmig, Bocquet, et al., 2004Helmig, Bocquet, et al., 2004
Comment MSDC-RI MSDC-RI MSDC-RI MSDC-RI MSDC-RI
Column type CapillaryCapillaryCapillaryCapillaryCapillary
Active phase DB-1DB-5DB-5CP Sil 8 CBUltra-2
Column length (m) 30.30.30.60.50.
Carrier gas HeHeHe
Substrate
Column diameter (mm) 0.320.250.250.250.2
Phase thickness (μm) 0.250.250.250.250.11
Program 40C(5min) => 20C/min => 100C => 2C/min => 160C => 40C/min => 250C (5min)60C(2min) => 3C/min => 240C => 10C/min => 270C (4.5min)50C (1min) => 5C/min => 100C => 10C/min => 250C (9min)0C => rapidly => 40C(8min) => 4C/min => 250C(10min)35C (1min) => 4C/min => 160C => 45C/min => 300C (10min)
I 1421.51452.1448.1456.1456.
ReferenceHelmig, Bocquet, et al., 2004Passos X.S., Castro A.C.M., et al., 2003Beaulieu and Grimm, 2001Duckham, Dodson, et al., 2001Sartin, Halsall, et al., 2001
Comment MSDC-RI MSDC-RI MSDC-RI MSDC-RI MSDC-RI
Column type CapillaryCapillaryCapillary
Active phase DB-5MSDB-5BPX-5
Column length (m) 30.25.50.
Carrier gas HeHeHe
Substrate
Column diameter (mm) 0.250.250.32
Phase thickness (μm) 0.250.250.5
Program 60 0C (3 min) 2 K/min -> 220 0C 5 K/min -> 250 0C (15 min)60C => 3C/min => 106C => 6C/min => 280COC (5min) => 60C/min => 60C(5min) => 4C/min => 250C
I 1435.1452.1458.
ReferenceBoulanger and Crouzet, 2000Afsharypuor, Jeiran, et al., 1998Bredie, Mottram, et al., 1998
Comment MSDC-RI MSDC-RI MSDC-RI

Van Den Dool and Kratz RI, polar column, custom temperature program

Data compiled by: NIST Mass Spectrometry Data Center, William E. Wallace, director

Column type CapillaryCapillary
Active phase CP-Wax 52CBDB-Wax
Column length (m) 60.30.
Carrier gas HeH2
Substrate
Column diameter (mm) 0.250.25
Phase thickness (μm) 0.250.25
Program 45C(5min) => 10C/min => 80C => 2C/min => 240C60 0C (3 min) 2 K/min -> 220 0C 5 K/min -> 250 0C (15 min)
I 1852.1876.
ReferenceCondurso, Verzera, et al., 2006Boulanger and Crouzet, 2000
Comment MSDC-RI MSDC-RI

References

Andriamaharavo, 2014
Andriamaharavo, N.R., Retention Data. NIST Mass Spectrometry Data Center., NIST Mass Spectrometry Data Center, 2014. [all data]

Carasek and Pawliszyn, 2006
Carasek, E.; Pawliszyn, J., Screening of Tropical Fruit Volatile Compounds Using Solid-Phase Microextraction (SPME) Fibers and Internally Cooled SPME Fiber, J. Agric. Food Chem., 2006, 54, 23, 8688-8696, https://doi.org/10.1021/jf0613942 . [all data]

Helmig, Bocquet, et al., 2004
Helmig, D.; Bocquet, F.; Pollmann, J.; Revermann, T., Analytical techniques for sesquiterpene emission rate studies in vegetation enclosure experiments, Atmos. Environ., 2004, 38, 4, 557-572, https://doi.org/10.1016/j.atmosenv.2003.10.012 . [all data]

Passos X.S., Castro A.C.M., et al., 2003
Passos X.S.; Castro A.C.M.; Pires J.S.; Garcia A.C.F.; Campos F.C.; Fernandes O.F.L.; Paula J.R.; Ferreira H.D.; Santos S.C.; Ferri P.H.; Silva M.D.R., Composition and antifungal activity of the essential oils of Caryocar brasiliensis, Pharm. Biol., 2003, 41, 5, 319-324, https://doi.org/10.1076/phbi.41.5.319.15936 . [all data]

Beaulieu and Grimm, 2001
Beaulieu, J.C.; Grimm, C.C., Identification of volatile compounds in cantaloupe at various developmental stages using solid phase microextraction, J. Agric. Food Chem., 2001, 49, 3, 1345-1352, https://doi.org/10.1021/jf0005768 . [all data]

Duckham, Dodson, et al., 2001
Duckham, S.C.; Dodson, A.T.; Bakker, J.; Ames, J.M., Volatile flavour components of baked potato flesh. A comparison of eleven potato cultivars, Nahrung/Food, 2001, 45, 5, 317-323, https://doi.org/10.1002/1521-3803(20011001)45:5<317::AID-FOOD317>3.0.CO;2-4 . [all data]

Sartin, Halsall, et al., 2001
Sartin, J.H.; Halsall, C.J.; Davison, B.; Owen, S.; Hewitt, C.N., Determination of biogenic volatile organic compounds (C8-C16) in the coastal atmosphere at Mace Head, Ireland, Anal. Chim. Acta., 2001, 428, 1, 61-72, https://doi.org/10.1016/S0003-2670(00)01214-9 . [all data]

Boulanger and Crouzet, 2000
Boulanger, R.; Crouzet, J., Free and bound flavour components of Amazonian fruits: 2. cupuacu volatile compounds, Flavour Fragr. J., 2000, 15, 4, 251-257, https://doi.org/10.1002/1099-1026(200007/08)15:4<251::AID-FFJ905>3.0.CO;2-2 . [all data]

Afsharypuor, Jeiran, et al., 1998
Afsharypuor, S.; Jeiran, K.; Jazy, A.A., First investigation of the flavour profiles of the leaf, ripe fruit and root of Capparis spinosa var. mucronifolia from Iran, Pharm. Acta Helv., 1998, 72, 5, 307-309, https://doi.org/10.1016/S0031-6865(97)00023-X . [all data]

Bredie, Mottram, et al., 1998
Bredie, W.L.P.; Mottram, D.S.; Guy, R.C.E., Aroma volatiles generated during extrusion cooking of maize flour, J. Agric. Food Chem., 1998, 46, 4, 1479-1487, https://doi.org/10.1021/jf9708857 . [all data]