Pentafluoropropanoic acid methyl ester

Gas phase thermochemistry data

Data compiled by: Hussein Y. Afeefy, Joel F. Liebman, and Stephen E. Stein

Quantity Value Units Method Reference Comment
Δfgas-341.37 ± 0.66kcal/molCcrSlavutskaya, Kolesov, et al., 1974Reanalyzed by Kolesov and Kozina, 1986, Original value = -337.54 kcal/mol

Condensed phase thermochemistry data

Data compiled by: Hussein Y. Afeefy, Joel F. Liebman, and Stephen E. Stein

Quantity Value Units Method Reference Comment
Δfliquid-349.67 ± 0.43kcal/molCcrSlavutskaya, Kolesov, et al., 1974Reanalyzed by Pedley, Naylor, et al., 1986, Original value = -345.84 ± 0.42 kcal/mol
Quantity Value Units Method Reference Comment
Δcliquid-342.88 ± 0.41kcal/molCcrSlavutskaya, Kolesov, et al., 1974

References

Slavutskaya, Kolesov, et al., 1974
Slavutskaya, G.M.; Kolesov, V.P.; Borisov, S.B., Standard enthalpies of formation of 1,1,1-trifluoropropyl ether and methyl pentafluoropropionate, Russ. J. Phys. Chem. (Engl. Transl.), 1974, 48, 456-457. [all data]

Kolesov and Kozina, 1986
Kolesov, V.P.; Kozina, M.P., Thermochemistry of organic and organohalogen compounds, Russ. Chem. Rev., 1986, 55, 912. [all data]

Pedley, Naylor, et al., 1986
Pedley, J.B.; Naylor, R.D.; Kirby, S.P., Thermochemical Data of Organic Compounds, Chapman and Hall, New York, 1986, 1-792. [all data]