3-((1,1-Dimethylethyl)-thio)-1-propene

Gas phase thermochemistry data

Data compiled by: Hussein Y. Afeefy, Joel F. Liebman, and Stephen E. Stein

Quantity Value Units Method Reference Comment
Δfgas-46. ± 2.kJ/molCcbMackle and Mayrick, 1962Authors' Ucomb=-948.27 kcal/mol

Condensed phase thermochemistry data

Data compiled by: Hussein Y. Afeefy, Joel F. Liebman, and Stephen E. Stein

Quantity Value Units Method Reference Comment
Δfliquid-90.7 ± 1.6kJ/molCcbMackle and Mayrick, 1962Authors' Ucomb=-948.27 kcal/mol
Quantity Value Units Method Reference Comment
Δcliquid-5266.6 ± 2.5kJ/molCcbMackle and Mayrick, 1962Authors' Ucomb=-948.27 kcal/mol

Reaction thermochemistry data

Data compiled by: Hussein Y. Afeefy, Joel F. Liebman, and Stephen E. Stein

Individual Reactions

3-((1,1-Dimethylethyl)-thio)-1-propene = (E) t-Butyl-1-propenylsulfide

By formula: C7H14S = C7H14S

Quantity Value Units Method Reference Comment
Δr-13.7 ± 1.3kJ/molEqkKimmelma, 1988liquid phase; solvent: DMSO; NMR

References

Mackle and Mayrick, 1962
Mackle, H.; Mayrick, R.G., Studies in thermochemistry of organic sulphides. Part 3.-The gas-phase heats of formation of diphenyl sulphide, dibenzyl sulphide, diphenyl disulphide,4-thia-1-hexene and 4-thia-5,5-dimethyl-1-hexene, Trans. Faraday Soc., 1962, 58, 238-243. [all data]

Kimmelma, 1988
Kimmelma, R., Structure-stability relationships in vinyl sulfides. III. Stabilization caused by different alkylthio and phenylthio groups attached to an olefinic double bond, Acta Chem. Scand., 1988, 42, 550-555. [all data]