Tetracyclo[6.1.0.0<sup>2,4</sup>.0<sup>5,7</sup>]nonane(1&#945;,2&#945;,4&#945;,5&#946;,7&#946;,8&#945;)-

Gas phase ion energetics data

Data compiled by: Sharon G. Lias, Rhoda D. Levin, and Sherif A. Kafafi

Ionization energy determinations

IE (eV) Method Reference Comment
9.0PESpanget-Larsen, Gleiter, et al., 1979Vertical value

References

Spanget-Larsen, Gleiter, et al., 1979
Spanget-Larsen, J.; Gleiter, R.; De Meijere, A.; Binger, P., Linear combination of Walsh orbitals in tris σ-homobenzenes, Tetrahedron, 1979, 35, 1385. [all data]