3-Hydroxybenzoic acid, 2TMS derivative

Van Den Dool and Kratz RI, non-polar column, temperature ramp

Data compiled by: NIST Mass Spectrometry Data Center, William E. Wallace, director

Column type CapillaryCapillaryCapillaryPackedPacked
Active phase VF-5MSOV-1CP Sil 5 CBOV-1OV-1
Column length (m) 30.10. 1.82.
Carrier gas HeHeN2N2N2
Substrate    100-120 meshSupelcoport
Column diameter (mm) 0.250.22
Phase thickness (μm) 0.250.17
Tstart (C) 60.70.60.70.80.
Tend (C) 270.270.280.290.240.
Heat rate (K/min)  5.6.28.4.
Initial hold (min)   0.50.5
Final hold (min)   5.
I 1573.1561.1559.1560.1559.
ReferenceTodua, 2011Lefevere, Verhaeghe, et al., 1989Wurth, Kumps, et al., 1989Tanaka, Hine, et al., 1980Mattsson and Petersson, 1977
Comment MSDC-RI MSDC-RI MSDC-RI MSDC-RI MSDC-RI
Column type Packed
Active phase OV-1
Column length (m) 2.
Carrier gas He
Substrate Chromosorb W HP (80-100 mesh)
Column diameter (mm)
Phase thickness (μm)
Tstart (C) 100.
Tend (C) 325.
Heat rate (K/min) 10.
Initial hold (min)
Final hold (min)
I 1555.
ReferenceButts, 1972
Comment MSDC-RI

Van Den Dool and Kratz RI, non-polar column, custom temperature program

Data compiled by: NIST Mass Spectrometry Data Center, William E. Wallace, director

Column type CapillaryPacked
Active phase DB-1OV-101
Column length (m)
Carrier gas He
Substrate
Column diameter (mm)
Phase thickness (μm)
Program not specifiednot specified
I 1560.1560.
ReferenceTsai, Oliphant, et al., 1985Tanaka and Hine, 1982
Comment MSDC-RI MSDC-RI

References

Todua, 2011
Todua, N.G., Retention Data. NIST Mass Spectrometry Data Center., NIST Mass Spectrometry Data Center, 2011. [all data]

Lefevere, Verhaeghe, et al., 1989
Lefevere, M.F.; Verhaeghe, B.J.; Declerck, D.H.; Van Bocxlaer, J.F.; De Leenheer, A.P.; De Sagher, R.M., Metabolic Profiling of Urinary Organic Acids by Single and Multicolumn Capillary Gas Chromatography, J. Chromatogr. Sci., 1989, 27, 1, 23-29, https://doi.org/10.1093/chromsci/27.1.23 . [all data]

Wurth, Kumps, et al., 1989
Wurth, C.; Kumps, A.; Mardens, Y., Urinary organic acids: Retention indices on two capillary gas chromatography columns, J. Chromatogr., 1989, 491, 186-192, https://doi.org/10.1016/S0378-4347(00)82831-5 . [all data]

Tanaka, Hine, et al., 1980
Tanaka, K.; Hine, D.G.; West-Dull, A.; Lynn, T.B., Gas-chromatographic method of analysis for urinary organic acids. I. Retention indices of 155 metabolically important compounds, Clin. Chem., 1980, 26, 13, 1839-1846. [all data]

Mattsson and Petersson, 1977
Mattsson, M.; Petersson, G., Reference GLC Data for the Analysis of Phenolic Compounds as Trimethylsilyl Derivatives, J. Chromatogr. Sci., 1977, 15, 12, 546-554, https://doi.org/10.1093/chromsci/15.12.546 . [all data]

Butts, 1972
Butts, W.C., Two-Column Gas Chromatography of Trimethylsilyl Derivatives of Biochemically Significant Compounds, Anal. Biochemistry, 1972, 46, 1, 187-199, https://doi.org/10.1016/0003-2697(72)90411-3 . [all data]