Decyl levulinate

Phase change data

Data compiled by: William E. Acree, Jr., James S. Chickos

Enthalpy of vaporization

ΔvapH (kJ/mol) Temperature (K) Method Reference Comment
76.1438.AStephenson and Malanowski, 1987Based on data from 423. - 580. K.
72.0524.N/ACowley and Schuette, 1933

References

Stephenson and Malanowski, 1987
Stephenson, Richard M.; Malanowski, Stanislaw, Handbook of the Thermodynamics of Organic Compounds, 1987, https://doi.org/10.1007/978-94-009-3173-2 . [all data]

Cowley and Schuette, 1933
Cowley, Milford A.; Schuette, H.A., Levulinic Acid. IV. The Vapor Pressures of its Normal-Alkyl Esters (C 7 ---C 10 ), J. Am. Chem. Soc., 1933, 55, 1, 387-391, https://doi.org/10.1021/ja01328a056 . [all data]