S,S-bis(trifluoromethyl)-N-[2,2,2-trifluoro-1-(trifluoromethyl)-1-[(2,2,2-trifluoro-1-trifluoromethyl]ethylidine)amino]ethyl sulfilimine

Phase change data

Data compiled by: William E. Acree, Jr., James S. Chickos

Enthalpy of vaporization

ΔvapH (kJ/mol) Temperature (K) Method Reference Comment
41.1344.AStephenson and Malanowski, 1987Based on data from 329. - 373. K. See also Swindell and Shreeve, 1972.

References

Stephenson and Malanowski, 1987
Stephenson, Richard M.; Malanowski, Stanislaw, Handbook of the Thermodynamics of Organic Compounds, 1987, https://doi.org/10.1007/978-94-009-3173-2 . [all data]

Swindell and Shreeve, 1972
Swindell, Richard F.; Shreeve, Jeanne M., Extensively rearranged derivatives of sulfur tetrafluoride, trifluoromethylsulfur trifluoride, and bis(trifluoromethyl)sulfur difluoride from hexafluoroisopropylideniminolithium reactions, J. Am. Chem. Soc., 1972, 94, 16, 5713-5718, https://doi.org/10.1021/ja00771a030 . [all data]