trans-β-Ocimene

Normal alkane RI, non-polar column, temperature ramp

Data compiled by: NIST Mass Spectrometry Data Center, William E. Wallace, director

Column type CapillaryCapillaryCapillaryCapillaryCapillary
Active phase HP-5 MSRTX-1Mega-5HP-5 MSHP-5 MS
Column length (m) 60.60.25.30.30.
Carrier gas HeliumHeliumHeliumHeliumHelium
Substrate
Column diameter (mm) 0.250.220.250.250.25
Phase thickness (μm) 0.250.250.250.250.25
Tstart (C) 40.60.50.40.50.
Tend (C) 250.230.220.250.180.
Heat rate (K/min) 3.2.3.3.2.
Initial hold (min) 1. 1.1.
Final hold (min) 20.5.5.3.
I 1048.1041.1050.1050.1050.
ReferenceSardashti, Valizadeh, et al., 2013Bendiabdellah, El Amine Dib, et al., 2012Dell'Agli, Sanna, et al., 2012Jian-Yu, Zhu, et al., 2012Phungpanya, Thongpoon, et al., 2012
Comment MSDC-RI MSDC-RI MSDC-RI MSDC-RI MSDC-RI
Column type CapillaryCapillaryCapillaryCapillaryCapillary
Active phase HP-5HP-5HP-5HP-5 MSHP-5
Column length (m) 25.25.25.30.30.
Carrier gas HydrogenHydrogenHydrogenHeliumHelium
Substrate
Column diameter (mm) 0.320.320.320.250.25
Phase thickness (μm) 0.520.520.520.250.25
Tstart (C) 40.40.40.50.60.
Tend (C) 280.280.280.250.240.
Heat rate (K/min) 4.4.4.7.3.
Initial hold (min)    1.
Final hold (min) 10.10.10.5.
I 1036.1045.1045.1049.1050.
ReferenceVelickovic, Ristic, et al., 2012Velickovic, Ristic, et al., 2012Velickovic, Ristic, et al., 2012Zouari, Ayadi, et al., 2012Bertoli, Lepnardi, et al., 2011
Comment MSDC-RI MSDC-RI MSDC-RI MSDC-RI MSDC-RI
Column type CapillaryCapillaryCapillaryCapillaryCapillary
Active phase DB-5CP-Sil 5 CBHP-5SE-30 MSHP-5 MS
Column length (m) 30.25.30.30.30.
Carrier gas HeliumHydrogenHeliumHeliumHelium
Substrate
Column diameter (mm) 0.250.250.320.250.25
Phase thickness (μm) 0.250.150.250.250.25
Tstart (C) 40.50.60.50.40.
Tend (C) 250.230.240.250.260.
Heat rate (K/min) 3.3.3.5.4.
Initial hold (min) 5. 2.5.
Final hold (min) 20.  10.5.
I 1049.1045.1051.1047.1050.
ReferenceCao, Li, et al., 2011Esseien, Aboaba, et al., 2011Kahriman, Tosun, et al., 2011Menichini, Tundis, et al., 2011Miyazawa, Marumoto, et al., 2011
Comment MSDC-RI MSDC-RI MSDC-RI MSDC-RI MSDC-RI
Column type CapillaryCapillaryCapillaryCapillaryCapillary
Active phase HP-5ZB-5ZB-5DB-5 MSDB-5 MS
Column length (m) 60.30.30.25.25.
Carrier gas HeliumNitrogenNitrogenHeliumHelium
Substrate
Column diameter (mm) 0.250.250.250.300.30
Phase thickness (μm) 0.250.250.250.250.25
Tstart (C) 35.40.40.50.50.
Tend (C) 220.200.200.240.240.
Heat rate (K/min) 10.5.5.3.3.
Initial hold (min) 1.5.5.
Final hold (min) 15. 5.
I 1048.1059.1058.1046.1046.
ReferencePiyachaiseth, Jirapakkul, et al., 2011Vazques, Aimar, et al., 2011Vazquez, Demmel, et al., 2011Chalchat, Figueredo, et al., 2010Chalchat, Figueredo, et al., 2010
Comment MSDC-RI MSDC-RI MSDC-RI MSDC-RI MSDC-RI
Column type CapillaryCapillaryCapillaryCapillaryCapillary
Active phase RTx-1RTX-1DB-5OV-1DB-5 MS
Column length (m) 60.60.30.30.60.
Carrier gas HeliumHeliumHeliumHeliumHelium
Substrate
Column diameter (mm) 0.220.220.250.250.25
Phase thickness (μm) 0.250.250.250.250.25
Tstart (C) 60.60.50.50.40.
Tend (C) 230.230.250.250.250.
Heat rate (K/min) 2.2.2.5.5.
Initial hold (min)    3.15.
Final hold (min) 35.30. 2.15.
I 1041.1041.1050.1028.1048.
ReferenceDib, Bendahou, et al., 2010Dib, Djabou, et al., 2010Ho, Wang, et al., 2010Hu, Liang, et al., 2010Mesa-Arango, Betancur-Galvis, et al., 2010
Comment MSDC-RI MSDC-RI MSDC-RI MSDC-RI MSDC-RI
Column type CapillaryCapillaryCapillaryCapillaryCapillary
Active phase BP-1HP-5HP-5 MSHP-5 MSHP-5
Column length (m)  30.30.30.30.
Carrier gas NitrogenHeliumHeliumHeliumHydrogen
Substrate
Column diameter (mm)  0.250.250.250.25
Phase thickness (μm)  0.250.250.250.25
Tstart (C) 60.40.60.100.70.
Tend (C) 220.260.220.220.290.
Heat rate (K/min) 5.4.5.2.5.
Initial hold (min) 10. 10.
Final hold (min) 30.5.
I 1041.1049.1052.1044.1048.
ReferenceMishra, Chaudhary, et al., 2010Miyazawa, Kawauchi, et al., 2010Ogunwande, Flamini, et al., 2010Pripdeevech, Chumpolsri, et al., 2010Radulovic, Dordevic, et al., 2010
Comment MSDC-RI MSDC-RI MSDC-RI MSDC-RI MSDC-RI
Column type CapillaryCapillaryCapillaryCapillaryCapillary
Active phase SLB-5 MSSLB-5 MSDB-1-MSCP Sil 5 CBDB-5
Column length (m) 10.10.60.25.30.
Carrier gas HeliumHeliumHelium Helium
Substrate
Column diameter (mm) 0.100.100.250.250.25
Phase thickness (μm) 0.100.100.250.150.25
Tstart (C) 50.50.30.50.80.
Tend (C) 250.250.200.230.240.
Heat rate (K/min) 10.10.2.3.3.
Initial hold (min)   4.
Final hold (min)   35. 2.
I 1045.1053.1041.1045.1046.
ReferenceScandinaro, Tranchida, et al., 2010Scandinaro, Tranchida, et al., 2010Takeoka, Hobbs, et al., 2010Usman, Zubair, et al., 2010Vahirua-Lechat, Mitermite, et al., 2010
Comment MSDC-RI MSDC-RI MSDC-RI MSDC-RI MSDC-RI
Column type CapillaryCapillaryCapillaryCapillaryCapillary
Active phase DB-5OV-101SE-54ZB-5SPB-5
Column length (m) 30.50.30.30.30.
Carrier gas HeliumHeliumHeliumHeliumNitrogen
Substrate
Column diameter (mm) 0.250.250.250.250.53
Phase thickness (μm) 0.250.250.250.250.50
Tstart (C) 60.70.60.50.50.
Tend (C) 240.220.260.240.210.
Heat rate (K/min) 3.2.2.3.3.
Initial hold (min)   5. 5.
Final hold (min)   999.1.45.
I 1036.1037.1050.1016.1061.
ReferenceAlim, Goze, et al., 2009Benites, Moiteiro, et al., 2009Dayisoylu and Alma, 2009Gardini, Beletti, et al., 2009Gilani, Shah, et al., 2009
Comment MSDC-RI MSDC-RI MSDC-RI MSDC-RI MSDC-RI
Column type CapillaryCapillaryCapillaryCapillaryCapillary
Active phase DB-5DB-5DB-5HP-5MSHP-5
Column length (m) 30.50.30.60.25.
Carrier gas HeliumNitrogenHeliumHeliumHelium
Substrate
Column diameter (mm) 0.250.200.250.250.20
Phase thickness (μm) 0.250.320.250.250.33
Tstart (C) 50.60.50.70.60.
Tend (C) 250.220.250.250.240.
Heat rate (K/min) 5.5.5.3.3.
Initial hold (min) 2.3.
Final hold (min)     7.
I 1050.1050.1069.1048.1035.
ReferenceHo, Wang, et al., 2009Kazemi and Akhavani, 2009Koba, Catherine, et al., 2009Males, Plazibat, et al., 2009Maridass, 2009
Comment MSDC-RI MSDC-RI MSDC-RI MSDC-RI MSDC-RI
Column type CapillaryCapillaryCapillaryCapillaryCapillary
Active phase RTX-1RTX-1DB-55 % Phenyl methyl siloxaneDB-5
Column length (m) 60.60.30.60.50.
Carrier gas HeliumHeliumHeliumHeliumNitrogen
Substrate
Column diameter (mm) 0.220.220.250.250.20
Phase thickness (μm) 0.250.250.250.250.32
Tstart (C) 60.60.45.90.60.
Tend (C) 230.230.250.225.220.
Heat rate (K/min) 2.2.3.3.5.
Initial hold (min)   3. 3.
Final hold (min) 30.30.5.3.5.
I 1040.1041.1051.1049.1050.
ReferenceMuseli, Pau, et al., 2009Museli, Pau, et al., 2009Porto, Decorti, et al., 2009Retta, Gattuso, et al., 2009Shafaghat and Sadeghi, 2009
Comment MSDC-RI MSDC-RI MSDC-RI MSDC-RI MSDC-RI
Column type CapillaryCapillaryCapillaryCapillaryCapillary
Active phase DB-5 MSDB-5 MSHP-5MSHP-5 MSHP-5
Column length (m) 30.30.30.30.30.
Carrier gas HeliumHeliumHeliumHeliumHelium
Substrate
Column diameter (mm) 0.250.250.250.250.25
Phase thickness (μm) 0.250.250.250.250.25
Tstart (C) 50.40.50.50.50.
Tend (C) 220.250.240.280.280.
Heat rate (K/min) 3.4.5.4.9.
Initial hold (min) 2.2.  3.
Final hold (min) 70.2.  3.
I 1044.1049.1050.1047.1050.
ReferenceShimizu, Imayoshi, et al., 2009Su, Wang, et al., 2009Wannes, Mhamdi, et al., 2009Zhao, Zeng, et al., 2009Aicha, Ines, et al., 2008
Comment MSDC-RI MSDC-RI MSDC-RI MSDC-RI MSDC-RI
Column type CapillaryCapillaryCapillaryCapillaryCapillary
Active phase HP-5 MSHP-5HP-5 MSSLB-5 MSZB-1
Column length (m) 30.30.30.30.30.
Carrier gas  N2HeliumHeliumNitrogen
Substrate
Column diameter (mm) 0.250.250.250.250.25
Phase thickness (μm)  0.250.250.250.25
Tstart (C) 60.60.50.50.45.
Tend (C) 280.220.230.250.230.
Heat rate (K/min) 3.5.4.3.3.
Initial hold (min)  10.4.2.
Final hold (min)   10.10.
I 1040.1052.1050.1045.1033.
ReferenceBaziou, Couladis, et al., 2008Flamini, Tebano, et al., 2008Forero, Quijano, et al., 2008Lo Presti, Sciarrone, et al., 2008Mierendorff, Stahl-Biskup, et al., 2008
Comment MSDC-RI MSDC-RI MSDC-RI MSDC-RI MSDC-RI
Column type CapillaryCapillaryCapillaryCapillaryCapillary
Active phase DB-5 MSHP-5 MSBPX-5RTX-5HP-5
Column length (m) 30.30.7.520.30.
Carrier gas HeliumHeliumHeliumHeliumHelium
Substrate
Column diameter (mm) 0.250.250.100.180.25
Phase thickness (μm) 0.250.2510.0.200.32
Tstart (C) 50.60.60.50.60.
Tend (C) 300.250.240.280.250.
Heat rate (K/min) 5.2.3.4.5.
Initial hold (min) 5.8. 1.30.
Final hold (min) 5.15.
I 1044.1045.1050.1052.1051.
ReferenceNoudogbessi, Yedomonhan, et al., 2008Sahraoui, Vian, et al., 2008Shellie, 2008Skalicka-Wozniak, Los, et al., 2008Yassa and Akhani, 2008
Comment MSDC-RI MSDC-RI MSDC-RI MSDC-RI MSDC-RI
Column type CapillaryCapillaryCapillaryCapillaryCapillary
Active phase HP-5 MSSE-54DB-5HP-5MSDB-5
Column length (m) 30.30.50.30.30.
Carrier gas HeliumHeliumNitrogenHeHe
Substrate
Column diameter (mm) 0.250.250.200.250.26
Phase thickness (μm) 0.250.250.320.250.25
Tstart (C) 50.60.60.60.60.
Tend (C) 230.260.220.280.240.
Heat rate (K/min) 3.2.5.3.3.
Initial hold (min) 10.5.3.
Final hold (min) 10.20.5.
I 1050.1051.1045.1043.1036.
ReferenceAdams, Beauchamp, et al., 2007Alma, Ertas, et al., 2007Amiri, 2007Basta, Pavlovic, et al., 2007Bos, Woerdenbag, et al., 2007
Comment MSDC-RI MSDC-RI MSDC-RI MSDC-RI MSDC-RI
Column type CapillaryCapillaryCapillaryCapillaryCapillary
Active phase HP-5DB-5MSDB-5HP-5ZP-5
Column length (m) 30.30.30.30.60.
Carrier gas N2HeHeliumHeliumHe
Substrate
Column diameter (mm) 0.250.250.260.250.25
Phase thickness (μm) 0.250.250.250.260.25
Tstart (C) 50.60.60.60.40.
Tend (C) 240.240.290.240.260.
Heat rate (K/min) 5.3.3.4.6.
Initial hold (min) 1.  2.7.
Final hold (min) 4.  20.1.
I 1050.1050.1036.1049.1058.
ReferenceCheraif, Ben Jannet, et al., 2007Da Silva J.K.R., Sousa P.J.C., et al., 2007Elfami, Bos, et al., 2007Farsam, Amanlou, et al., 2007Füssel, Dötterl, et al., 2007
Comment MSDC-RI MSDC-RI MSDC-RI MSDC-RI MSDC-RI
Column type CapillaryCapillaryCapillaryCapillaryCapillary
Active phase DB-1Col-Elite 5MSBP-1DB-5DB-5
Column length (m) 60.30. 30.30.
Carrier gas NitrogenHeHeHeHe
Substrate
Column diameter (mm) 0.250.25 0.250.25
Phase thickness (μm) 0.250.25 0.250.25
Tstart (C) 60.30.60.60.40.
Tend (C) 250.246.220.300.240.
Heat rate (K/min) 4.3.5.3.3.
Initial hold (min) 1.
Final hold (min) 10. 6.
I 1040.1057.1040.1031.1003.
ReferenceGhasempour, Shirinpour, et al., 2007Gudaityte and Venskutonis R.P., 2007Kiran, Devi, et al., 2007Limberger, Scopel, et al., 2007Machado, Bastos, et al., 2007
Comment MSDC-RI MSDC-RI MSDC-RI MSDC-RI MSDC-RI
Column type CapillaryCapillaryCapillaryCapillaryCapillary
Active phase RTX-5Sil MSZB-5DB-1DB-5HP-5
Column length (m) 30.30.30.30.25.
Carrier gas He HeliumHeliumH2
Substrate
Column diameter (mm) 0.250.250.250.250.2
Phase thickness (μm) 0.250.250.250.250.33
Tstart (C) 50.60.50.60.60.
Tend (C) 260.220.260.300.240.
Heat rate (K/min) 5.4.2.53.3.
Initial hold (min) 2.5.1.
Final hold (min) 10.20.20.
I 1050.1054.1037.1033.1051.
ReferenceMatasyoh, Matasyoh, et al., 2007Mohottalage, Tabacchi, et al., 2007Monser-Esfahani, Karamkhani, et al., 2007Moreno, Lima, et al., 2007Oliveira, Leitão, et al., 2007
Comment MSDC-RI MSDC-RI MSDC-RI MSDC-RI MSDC-RI
Column type CapillaryCapillaryCapillaryCapillaryCapillary
Active phase DB-1BPX-5DB-1HP-5 MSDB-5
Column length (m) 50.50.60.60.30.
Carrier gas HeHeNitrogenHydrogenHe
Substrate
Column diameter (mm) 0.250.220.250.250.25
Phase thickness (μm) 0.251.0.250.250.25
Tstart (C) 95.50.60.60.50.
Tend (C) 240.300.250.260.240.
Heat rate (K/min) 4.4.4.4.4.
Initial hold (min)  1.1.
Final hold (min)  10.10.20.
I 1041.1056.1040.1039.1047.
ReferencePala-Paul, Brophy, et al., 2007Rali, Wossa, et al., 2007Reza, Ebrahim, et al., 2007Rojas, Velasco, et al., 2007Sefidkon, Abbasi, et al., 2007
Comment MSDC-RI MSDC-RI MSDC-RI MSDC-RI MSDC-RI
Column type CapillaryCapillaryCapillaryCapillaryCapillary
Active phase DB-5DB-5Elite-5MSHP-5 MSHP-5MS
Column length (m) 30.30.30.30.30.
Carrier gas   HeHeliumHe
Substrate
Column diameter (mm) 0.250.250.320.250.25
Phase thickness (μm) 0.250.250.50.250.25
Tstart (C) 40.40.40.60.60.
Tend (C) 210.250.280.280.280.
Heat rate (K/min) 2.2.4.3.3.
Initial hold (min)   5.
Final hold (min) 33.33.10.
I 1057.1057.1046.1053.1015.
ReferenceSylvestre, Longtin, et al., 2007Sylvestre, Pichette, et al., 2007Tava, Pecetti, et al., 2007Tsokou, Georgopoulos, et al., 2007Tzakou, Bazos, et al., 2007
Comment MSDC-RI MSDC-RI MSDC-RI MSDC-RI MSDC-RI
Column type CapillaryCapillaryCapillaryCapillaryCapillary
Active phase HP-5 MSHP-5MSHP-5HP-5HP-5
Column length (m) 30.30.30.30.30.
Carrier gas HeliumHeHeN2N2
Substrate
Column diameter (mm) 0.250.250.250.250.25
Phase thickness (μm) 0.250.250.320.250.25
Tstart (C) 60.40.60.50.50.
Tend (C) 280.250.250.280.280.
Heat rate (K/min) 3.3.5.9.9.
Initial hold (min)  5.30.3.3.
Final hold (min)  10. 3.3.
I 1050.1046.1051.1047.1048.
ReferenceVagionas, Graikou, et al., 2007Vichi, Riu-Aumatell, et al., 2007Yassa and Akhani, 2007Abdelwahed, Hayder, et al., 2006Abdelwahed, Hayder, et al., 2006
Comment MSDC-RI MSDC-RI MSDC-RI MSDC-RI MSDC-RI
Column type CapillaryCapillaryCapillaryCapillaryCapillary
Active phase CP Sil 5 CBHP-5HP-1BP-1HP-1
Column length (m) 25.60.50.50.50.
Carrier gas HeHeN2 He
Substrate
Column diameter (mm)  0.250.20.220.2
Phase thickness (μm)  0.250.330.250.33
Tstart (C) 80.60.60.60.60.
Tend (C) 270.250.250.220.250.
Heat rate (K/min) 10.3.2.2.2.
Initial hold (min)     4.
Final hold (min)   20.20.30.
I 1041.1047.1036.1037.1032.
ReferenceAyoub, Al-Azizi, et al., 2006Bertrand, Comte, et al., 2006Berlioz, Cordella, et al., 2006Boti, Yao, et al., 2006Castel, Fernandez, et al., 2006
Comment MSDC-RI MSDC-RI MSDC-RI MSDC-RI MSDC-RI
Column type CapillaryCapillaryCapillaryCapillaryCapillary
Active phase SPB-1Ultra-2HP-5HP-5MSDB-5
Column length (m) 30.25.30.30.30.
Carrier gas HeliumH2He Helium
Substrate
Column diameter (mm) 0.200.250.320.250.26
Phase thickness (μm) 0.200.330.250.250.25
Tstart (C) 70.40.60.60.60.
Tend (C) 220.280.246.280.290.
Heat rate (K/min) 3.3.3.4.3.
Initial hold (min)  2.
Final hold (min) 15.10.
I 1035.1056.1050.1053.1036.
ReferenceCavaleiro, Pinto, et al., 2006Ceva-Antunes, Bizzo, et al., 2006Coronel, Cerda-Garcia-Rojas, et al., 2006Ebrahim Sajjadi and Mehregan, 2006Elfami, Komar, et al., 2006
Comment MSDC-RI MSDC-RI MSDC-RI MSDC-RI MSDC-RI
Column type CapillaryCapillaryCapillaryCapillaryCapillary
Active phase BP-1BP-1HP-1HP-5DB-5
Column length (m) 50.50.50.30.30.
Carrier gas HeHeHeHeHe
Substrate
Column diameter (mm) 0.220.220.20.250.25
Phase thickness (μm) 0.250.250.330.250.25
Tstart (C) 60.60.60.50.50.
Tend (C) 220.220.250.300.250.
Heat rate (K/min) 2.2.2.5.3.
Initial hold (min)    5.
Final hold (min) 20.20.60.5.10.
I 1034.1034.1033.1048.1041.
ReferenceFanciullino, Tomi, et al., 2006Fanciullino, Tomi, et al., 2006Fernandez, Pintaric, et al., 2006Figuérédo, Cabassu, et al., 2006Havlik, Kokoska, et al., 2006
Comment MSDC-RI MSDC-RI MSDC-RI MSDC-RI MSDC-RI
Column type CapillaryCapillaryCapillaryCapillaryCapillary
Active phase HP-5HP-5MSDB-5CP Sil 5 CBBP-1
Column length (m) 30.30.30.25.
Carrier gas HeHeHelium Helium
Substrate
Column diameter (mm) 0.250.250.250.25
Phase thickness (μm) 0.250.250.25
Tstart (C) 60.60.60.50.60.
Tend (C) 240.260.260.230.220.
Heat rate (K/min) 4.4.3.3.5.
Initial hold (min)
Final hold (min)     6.
I 1050.1050.1047.1038.1040.
ReferenceIbañez and Usubillaga, 2006Ibanez and Usubillaga, 2006Javidnia, Miri, et al., 2006Kasali, Ekundayo, et al., 2006Kiran, Bhavani, et al., 2006
Comment MSDC-RI MSDC-RI MSDC-RI MSDC-RI MSDC-RI
Column type CapillaryCapillaryCapillaryCapillaryCapillary
Active phase Methyl SiliconeCP Sil 5 CBCP Sil 5 CBDB-5DB-5
Column length (m) 25.30.30.30.30.
Carrier gas HeN2N2HeliumHe
Substrate
Column diameter (mm) 0.250.320.250.250.25
Phase thickness (μm) 0.250.250.250.250.25
Tstart (C) 90.50.50.50.60.
Tend (C) 220.300.200.250.220.
Heat rate (K/min) 7.4.5.3.4.
Initial hold (min) 2.  5.5.
Final hold (min)
I 1044.1043.1038.1048.1052.
ReferenceKitchlu, Bakshi, et al., 2006Lis and Milczarek, 2006Martin, Joseph, et al., 2006Mirza, Navaei, et al., 2006Morteza-Semnani K., Saeedi M., et al., 2006
Comment MSDC-RI MSDC-RI MSDC-RI MSDC-RI MSDC-RI
Column type CapillaryCapillaryCapillaryCapillaryCapillary
Active phase DB-5DB-5DB-5SE-52DB-1
Column length (m) 30.30.25.50.50.
Carrier gas He N2HeliumN2
Substrate
Column diameter (mm) 0.250.250.250.250.25
Phase thickness (μm) 0.250.250.15 0.25
Tstart (C) 50.50.50.50.95.
Tend (C) 250.265.200.240.240.
Heat rate (K/min) 4.2.54.3.4.
Initial hold (min)  0.53.
Final hold (min)
I 1052.1047.1045.1050.1048.
ReferenceNajafpour Navaei, Mirza, et al., 2006Nickavar B., Kamalinejad M., et al., 2006Ouamba, Ouabonzi, et al., 2006Ozcan, Chalchat, et al., 2006Pala-Paul J., Perez-Alonso M.J., et al., 2006
Comment MSDC-RI MSDC-RI MSDC-RI MSDC-RI MSDC-RI
Column type CapillaryCapillaryCapillaryCapillaryCapillary
Active phase SPB-5DB-5DB-5HP-5HP-5MS
Column length (m) 30.30.30.30.30.
Carrier gas HeliumHydrogenHydrogenH2He
Substrate
Column diameter (mm) 0.250.250.250.250.25
Phase thickness (μm) 0.250.250.250.250.25
Tstart (C) 60.70.70.50.60.
Tend (C) 250.280.280.280.280.
Heat rate (K/min) 4.4.4.4.3.
Initial hold (min) 2.4.4.2.
Final hold (min) 20.  10.
I 1051.1050.1050.1050.1017.
ReferencePino, Marquez, et al., 2006Pino, Marbot, et al., 2006Pino, Marbot, et al., 2006Pino, Sauri-Duch, et al., 2006Pitarokili, Tzakou, et al., 2006
Comment MSDC-RI MSDC-RI MSDC-RI MSDC-RI MSDC-RI
Column type CapillaryCapillaryCapillaryCapillaryCapillary
Active phase HP-5HP-5MSDB-5DB-5DB-5
Column length (m) 25.30.30.30.30.
Carrier gas H2 HeHeHe
Substrate
Column diameter (mm) 0.320.250.250.250.25
Phase thickness (μm) 0.250.250.250.250.25
Tstart (C) 60.50.60.60.60.
Tend (C) 240.250.200.200.260.
Heat rate (K/min) 3.10.2.2.5.
Initial hold (min)  5.
Final hold (min)   60.60.
I 1052.1049.1050.1051.1049.
ReferencePotzernheim, Bizzo, et al., 2006Robinson, 2006Rout, Naik, et al., 2006Rout, Naik, et al., 2006Sabulal, Dan, et al., 2006
Comment MSDC-RI MSDC-RI MSDC-RI MSDC-RI MSDC-RI
Column type CapillaryCapillaryCapillaryCapillaryCapillary
Active phase FSOT-RSL-200DB-5DB-5DB-1HP-5
Column length (m) 30.30.30.60.25.
Carrier gas HydrogenHeHeHeN2
Substrate
Column diameter (mm) 0.320.250.250.250.2
Phase thickness (μm) 0.250.250.25 0.33
Tstart (C) 40.50.40.40.30.
Tend (C) 280.240.240.250.280.
Heat rate (K/min) 6.4.4.4.3.
Initial hold (min) 5.
Final hold (min) 5.
I 1049.1053.1050.1042.1049.
ReferenceSchmidt, Jirovetz, et al., 2006Sefidkon, Abbasi, et al., 2006Sefidkon and Jamzad, 2006Sefidkon, Jamzad, et al., 2006Shafi, Jose, et al., 2006
Comment MSDC-RI MSDC-RI MSDC-RI MSDC-RI MSDC-RI
Column type CapillaryCapillaryCapillaryCapillaryCapillary
Active phase DB-5CP Sil 5 CBCP Sil 5 CBMethyl SiliconeSPB-5
Column length (m) 30.25.25.25.60.
Carrier gas H2H2 N2He
Substrate
Column diameter (mm) 0.200.250.250.30.32
Phase thickness (μm) 0.18  0.151.
Tstart (C) 60.50.50.50.40.
Tend (C) 240.230.230.210.230.
Heat rate (K/min) 3.3.3.2.3.
Initial hold (min)    5.5.
Final hold (min)     2.
I 1049.1044.1043.1055.1052.
ReferenceSilva, Oliveira, et al., 2006Tesso, König, et al., 2006Tesso, Kubeczka, et al., 2006Tonzibo, Coffy, et al., 2006Tornambe, Cornu, et al., 2006
Comment MSDC-RI MSDC-RI MSDC-RI MSDC-RI MSDC-RI
Column type CapillaryCapillaryCapillaryCapillaryCapillary
Active phase DB-5HP-5SPB-1SPB-1DB-5
Column length (m) 30.30.50.30.30.
Carrier gas N2HeHeHeHe
Substrate
Column diameter (mm) 0.250.250.20.250.25
Phase thickness (μm) 0.250.250.330.250.25
Tstart (C) 60.60.50.50.40.
Tend (C) 240.250.220.250.250.
Heat rate (K/min) 4.10.4.4.4.
Initial hold (min)  2.1.1.
Final hold (min)  10.10.10.
I 1049.1042.1037.1037.1038.
ReferenceTrilles, Bombarda, et al., 2006Wang, Yang, et al., 2006Wong, Lim, et al., 2006Wong, Sivasothy, et al., 2006Yadegarinia, Gachkar, et al., 2006
Comment MSDC-RI MSDC-RI MSDC-RI MSDC-RI MSDC-RI
Column type CapillaryCapillaryCapillaryCapillaryCapillary
Active phase SE-30DB-5HP-5MSDB-5DB-5
Column length (m) 30.30.30.50.25.
Carrier gas HeHeHe
Substrate
Column diameter (mm)  0.250.250.30.25
Phase thickness (μm)  0.250.250.250.15
Tstart (C) 90.60.60.60.40.
Tend (C) 220.210.280.240.220.
Heat rate (K/min) 7.3.3.2.3.
Initial hold (min) 2.5.  5.
Final hold (min)
I 1041.1048.1041.1051.1045.
ReferenceAhuja, Bakshi, et al., 2005Askari and Sefidkon, 2005Basta, Tzakou, et al., 2005Chagonda and Chalchat, 2005Chagonda and Chalchat, 2005, 2
Comment MSDC-RI MSDC-RI MSDC-RI MSDC-RI MSDC-RI
Column type CapillaryCapillaryCapillaryCapillaryCapillary
Active phase SPB-5ZB-5ZB-5HP-5DB-5
Column length (m) 60.60.60.25.30.
Carrier gas HeHeHeHeHe
Substrate
Column diameter (mm) 0.320.250.250.20.25
Phase thickness (μm) 1.0.250.250.330.25
Tstart (C) 40.40.40.60.60.
Tend (C) 230.250.250.240.300.
Heat rate (K/min) 3.6.6.3.3.
Initial hold (min) 5.7.7. 3.
Final hold (min)  1.1.7.
I 1050.1058.1058.1044.1043.
ReferenceCornu, Kondjoyan, et al., 2005Dötterl and Jürgens, 2005Dötterl, Wolfe, et al., 2005Duarte, Figueira, et al., 2005Ferraz, Limberger, et al., 2005
Comment MSDC-RI MSDC-RI MSDC-RI MSDC-RI MSDC-RI
Column type CapillaryCapillaryCapillaryCapillaryCapillary
Active phase HP-5HP-5HP-5MSHP-5MSCP Sil 5 CB
Column length (m) 30.30.30.25.30.
Carrier gas HeHeHeHeN2
Substrate
Column diameter (mm) 0.250.250.250.250.25
Phase thickness (μm) 0.250.250.25 0.25
Tstart (C) 60.50.60.50.60.
Tend (C) 30.300.200.250.250.
Heat rate (K/min) 4.5.4.3.5.
Initial hold (min) 3.5.30.3.
Final hold (min) 15.5. 10.10.
I 1050.1048.1042.1052.1041.
ReferenceFerretti, Maggi, et al., 2005Figuérédo, Cabassu, et al., 2005Gauvin and Smadja, 2005Ghasemi Y., Faridi P., et al., 2005Jassbi, Mehrdad, et al., 2005
Comment MSDC-RI MSDC-RI MSDC-RI MSDC-RI MSDC-RI
Column type CapillaryCapillaryCapillaryCapillaryCapillary
Active phase DB-5DB-1DB-1RTX-5 MSSPB-5
Column length (m) 30.60.50.30.30.
Carrier gas HeHeN2HeHe
Substrate
Column diameter (mm) 0.320.250.250.250.25
Phase thickness (μm)  0.250.250.250.25
Tstart (C) 60.50.95.50.60.
Tend (C) 240.250.240.280.250.
Heat rate (K/min) 3.4.4.8.4.
Initial hold (min)  5. 2.2.
Final hold (min)    2.20.
I 1053.1049.1041.1052.1050.
ReferenceKhayyat and Karimi, 2005Khajeh, Yamini, et al., 2005Pala-Paul, Perez-Alonso, et al., 2005Pellati, Benvenuti, et al., 2005Pino, Marbot, et al., 2005
Comment MSDC-RI MSDC-RI MSDC-RI MSDC-RI MSDC-RI
Column type CapillaryCapillaryCapillaryCapillaryCapillary
Active phase CP Sil 5 CBCP Sil 5 CBHP-5MSHP-5MSHP-5MS
Column length (m) 30.30.30.30.30.
Carrier gas HeHeHeHeHe
Substrate
Column diameter (mm) 0.250.250.250.250.25
Phase thickness (μm) 0.250.250.250.250.25
Tstart (C) 40.40.60.60.60.
Tend (C) 220.220.220.280.275.
Heat rate (K/min) 4.4.6.4.4.
Initial hold (min) 1.1.3.
Final hold (min)
I 1050.1050.1056.1049.1046.
ReferenceRohloff and Bones, 2005Rohloff and Bones, 2005Safaei-Ghomi, Bamoniri, et al., 2005Sajjadi S.E. and Eskandari B., 2005Sajjadi and Ghannadi, 2005
Comment MSDC-RI MSDC-RI MSDC-RI MSDC-RI MSDC-RI
Column type CapillaryCapillaryCapillaryCapillaryCapillary
Active phase HP-5MSDB-5HP-5MSDB-5DB-5
Column length (m) 30.30.30.30.30.
Carrier gas HeHeHeHeHe
Substrate
Column diameter (mm) 0.250.250.250.250.25
Phase thickness (μm) 0.25 0.250.250.25
Tstart (C) 60.40.60.60.60.
Tend (C) 280.240.280.300.300.
Heat rate (K/min) 4.4.3.3.3.
Initial hold (min)   5.
Final hold (min)
I 1045.1050.1046.1039.1039.
ReferenceSajjadi, 2005Sefidkon and Jamzad, 2005Setzer, Noletto, et al., 2005Simoes-Pires C.A., Debenedetti S., et al., 2005Simoes-Pires C.A., Debenedetti S., et al., 2005
Comment MSDC-RI MSDC-RI MSDC-RI MSDC-RI MSDC-RI
Column type CapillaryCapillaryCapillaryCapillaryCapillary
Active phase DB-5HP-5MSBP-1DB-5HP-5 MS
Column length (m) 30.30.30.30.30.
Carrier gas HeHeN2 He
Substrate
Column diameter (mm) 0.250.250.320.250.25
Phase thickness (μm) 0.250.250.250.250.50
Tstart (C) 60.60.60.40.60.
Tend (C) 230.280.220.210.260.
Heat rate (K/min) 3.3.5.2.3.
Initial hold (min)    2.
Final hold (min) 20. 15.33.20.
I 1050.1044.1035.1058.1048.
ReferenceSkoula and Grayer, 2005Slavkovska, Couladis, et al., 2005Srivastava, Srivastava, et al., 2005Stevanovic, Garneau, et al., 2005Topçu, Barla, et al., 2005
Comment MSDC-RI MSDC-RI MSDC-RI MSDC-RI MSDC-RI
Column type CapillaryCapillaryCapillaryCapillaryCapillary
Active phase HP-5MSDB-5HP-5 MSDB-1HP-5MS
Column length (m) 30.30.30.50.30.
Carrier gas HeHeHelium
Substrate
Column diameter (mm) 0.250.320.250.250.25
Phase thickness (μm) 0.250.250.250.250.25
Tstart (C) 60.60.60.60.40.
Tend (C) 280.280.240.240.220.
Heat rate (K/min) 3.3.3.3.3.
Initial hold (min)     5.
Final hold (min)     10.
I 1017.1019.1050.1030.1046.
ReferenceTzakou, Bazos, et al., 2005Tzakou and Constantinidis, 2005Urdampilleta, Amat, et al., 2005Velasco-Negueruela, Pérez-Alonso, et al., 2005Vichi, Riu-Aumatell, et al., 2005
Comment MSDC-RI MSDC-RI MSDC-RI MSDC-RI MSDC-RI
Column type CapillaryCapillaryCapillaryCapillaryCapillary
Active phase SPB-1DB-5DB-5BP-1SE-52
Column length (m) 50.30.30.50.25.
Carrier gas HeH2He N2
Substrate
Column diameter (mm) 0.20.250.250.220.32
Phase thickness (μm) 0.330.250.250.250.15
Tstart (C) 50.50.90.60.45.
Tend (C) 220.290.220.220.200.
Heat rate (K/min) 4.4.7.2.3.
Initial hold (min) 3. 2. 5.
Final hold (min) 30. 5.20.30.
I 1037.1044.1037.1035.1063.
ReferenceWong, Lee, et al., 2005Abreu, Reis, et al., 2004Agnihotri, Thappa, et al., 2004Blanc, Muselli, et al., 2004Cakir, Kordali, et al., 2004
Comment MSDC-RI MSDC-RI MSDC-RI MSDC-RI MSDC-RI
Column type CapillaryCapillaryCapillaryCapillaryCapillary
Active phase DB-5SPB-5DB-5DB-5ZB-5
Column length (m) 30.60.30.25.60.
Carrier gas HeHeN2NitrogenHe
Substrate
Column diameter (mm) 0.250.320.250.250.25
Phase thickness (μm) 0.251.0.250.250.25
Tstart (C) 60.60.40.60.40.
Tend (C) 240.200.230.240.260.
Heat rate (K/min) 2.4.2.3.6.
Initial hold (min)     4.6
Final hold (min)  30.  1.
I 1050.1058.1050.1050.1054.
ReferenceCicció, 2004Gauvin, Ravaomanarivo, et al., 2004González, Guerra, et al., 2004JAvidnia, Mojab, et al., 2004Jürgens and Dötterl, 2004
Comment MSDC-RI MSDC-RI MSDC-RI MSDC-RI MSDC-RI
Column type CapillaryCapillaryCapillaryCapillaryCapillary
Active phase DB-5RTX-1SE-54RTX-1DB-5
Column length (m) 60.30.30.30.30.
Carrier gas HeN2HeN2
Substrate
Column diameter (mm) 0.250.250.0530.320.25
Phase thickness (μm) 0.250.251.50.250.25
Tstart (C) 40.60.100.60.40.
Tend (C) 280.300.250.300.210.
Heat rate (K/min) 4.4.5.4.2.
Initial hold (min) 4.   2.
Final hold (min)     33.
I 1046.1041.1055.1040.1058.
ReferenceKalvandi, Sefidkon, et al., 2004Kalemba and Thiem, 2004Kilic, Hafizoglu, et al., 2004Lis, Boczek, et al., 2004Lopez Arze, Collin, et al., 2004
Comment MSDC-RI MSDC-RI MSDC-RI MSDC-RI MSDC-RI
Column type CapillaryCapillaryCapillaryCapillaryCapillary
Active phase DB-5MSDB-1DB-1DB-1NB-30
Column length (m) 30.60.50.50.50.
Carrier gas HeHeHeN2He
Substrate
Column diameter (mm) 0.250.250.220.250.2
Phase thickness (μm) 0.250.250.250.250.25
Tstart (C) 60.50.70.95.50.
Tend (C) 280.270.220.240.250.
Heat rate (K/min) 3.4.4.4.2.
Initial hold (min)
Final hold (min) 30.
I 1016.1045.1034.1032.1039.
ReferenceMarongiu, Piras, et al., 2004Nik, Mirza, et al., 2004Palá-Paúl, García-Jiménez, et al., 2004Palá-Paúl, Velasco-Negueruela, et al., 2004Raal, Arak, et al., 2004
Comment MSDC-RI MSDC-RI MSDC-RI MSDC-RI MSDC-RI
Column type CapillaryCapillaryCapillaryCapillaryCapillary
Active phase NB-30DB-5MSHP-5MSDB-5DB-5
Column length (m) 50.30.30.30.30.
Carrier gas He He
Substrate
Column diameter (mm) 0.200.250.250.250.25
Phase thickness (μm) 0.250.250.250.250.25
Tstart (C) 50.90.60.50.60.
Tend (C) 250.200.280.250.300.
Heat rate (K/min) 2.30.4.3.3.
Initial hold (min)    5.
Final hold (min)  10.
I 1039.1064.1045.1050.1039.
ReferenceRaal, Paaver, et al., 2004Robledo and Arzuffi, 2004Sadeghpour, Asghari, et al., 2004Sefidkon, Jamzad, et al., 2004Suyenaga, Apel, et al., 2004
Comment MSDC-RI MSDC-RI MSDC-RI MSDC-RI MSDC-RI
Column type CapillaryCapillaryCapillaryCapillaryCapillary
Active phase DB-5CP Sil 8 CBCP Sil 8 CBDB-5HP-5MS
Column length (m) 30.30.30.30.30.
Carrier gas HeHe HeHe
Substrate
Column diameter (mm) 0.250.250.320.250.25
Phase thickness (μm) 0.250.250.250.250.25
Tstart (C) 60.50.50.60.60.
Tend (C) 300.200.200.240.280.
Heat rate (K/min) 3.10.5.4.3.
Initial hold (min)  3.5.
Final hold (min)  2.
I 1050.1050.1049.1040.1048.
ReferenceTirillini, Pellegrino, et al., 2004Wang and Guo-Y. -L., 2004Wang, Guo, et al., 2004Cabanillas, Lopez, et al., 2003Couladis, Özcan, et al., 2003
Comment MSDC-RI MSDC-RI MSDC-RI MSDC-RI MSDC-RI
Column type CapillaryCapillaryCapillaryCapillaryCapillary
Active phase DB-1DB-1RTX-5SilDB-5DB-5
Column length (m) 60.60.30.60.60.
Carrier gas HeHeHeHeHe
Substrate
Column diameter (mm) 0.250.250.250.320.32
Phase thickness (μm)   0.25
Tstart (C) 50.50.70.50.50.
Tend (C) 250.250.200.200.220.
Heat rate (K/min) 4.4.4.3.3.
Initial hold (min)
Final hold (min)   10.
I 1037.1037.1046.1045.1061.
ReferenceDabiri and Sefidkon, 2003Dabiri and Sefidkon, 2003, 2Dudai, Larkov, et al., 2003Edris, Shalaby, et al., 2003Edris, Shalaby, et al., 2003, 2
Comment MSDC-RI MSDC-RI MSDC-RI MSDC-RI MSDC-RI
Column type CapillaryCapillaryCapillaryCapillaryCapillary
Active phase HP-5MSHP-1DB-1HP-5MSHP-5
Column length (m) 30.30.30.30.30.
Carrier gas HeHeN2HeHe
Substrate
Column diameter (mm) 0.250.250.250.250.25
Phase thickness (μm) 0.250.250.250.250.25
Tstart (C) 60.70.50.60.60.
Tend (C) 220.200.200.275.275.
Heat rate (K/min) 5.10.5.4.4.
Initial hold (min) 20.
Final hold (min) 20.
I 1054.1039.1038.1048.1049.
ReferenceFeizbaksh, Saber Tehrani, et al., 2003Fekam Boyom, Amvam Zollo, et al., 2003Fekam Boyom, Ngouana, et al., 2003Ghannadi, Aghazari, et al., 2003Ghannadi and Zolfaghari, 2003
Comment MSDC-RI MSDC-RI MSDC-RI MSDC-RI MSDC-RI
Column type CapillaryCapillaryCapillaryCapillaryCapillary
Active phase HP-5MSRSL-200RSL-200CP Sil 5 CBDB-5
Column length (m) 30.30.30.25.30.
Carrier gas HeH2H2HeHe
Substrate
Column diameter (mm) 0.250.320.320.250.25
Phase thickness (μm) 0.250.250.250.250.25
Tstart (C) 60.40.40.35.60.
Tend (C) 275.280.280.280.280.
Heat rate (K/min) 4.6.6.5.5.
Initial hold (min)  5.5.2.5
Final hold (min)  5.5.
I 1049.1042.1039.1030.1035.
ReferenceHajhashemi, Ghannadi, et al., 2003Jirovetz, Buchbauer, et al., 2003Jirovetz, Buchbauer, et al., 2003, 2Kanjilal, Kotoky, et al., 2003Lago, de Ávila, et al., 2003
Comment MSDC-RI MSDC-RI MSDC-RI MSDC-RI MSDC-RI
Column type CapillaryCapillaryCapillaryCapillaryCapillary
Active phase DB-5MSDB-5ZB-1DB-1HP-5
Column length (m) 30.50.30.60.30.
Carrier gas HeHeN2HeHelium
Substrate
Column diameter (mm) 0.250.20.250.250.32
Phase thickness (μm) 0.250.250.250.25
Tstart (C) 60.50.45.50.70.
Tend (C) 240.220.230.270.210.
Heat rate (K/min) 3.3.3.4.2.
Initial hold (min)  2.
Final hold (min)     60.
I 1047.1048.1033.1046.1048.
ReferenceMaia, Taveira, et al., 2003Masotti, Juteau, et al., 2003Mierendorff, Stahl-Biskup, et al., 2003Mirza, Nik, et al., 2003Mookdasanit, Tamura, et al., 2003
Comment MSDC-RI MSDC-RI MSDC-RI MSDC-RI MSDC-RI
Column type CapillaryCapillaryCapillaryCapillaryCapillary
Active phase OV-101DB-5HP-5DB-1DB-5
Column length (m) 50.30.30.60.30.
Carrier gas HeH2HeHeHe
Substrate
Column diameter (mm) 0.20.250.250.250.2
Phase thickness (μm) 0.50.250.250.250.25
Tstart (C) 50.60.60.50.75.
Tend (C) 250.280.280.250.220.
Heat rate (K/min) 2.4.3.4.3.
Initial hold (min)  10.  4.
Final hold (min)  40.
I 1038.1051.1032.1025.1051.
ReferenceOrav, Kailas, et al., 2003Pino, Marbot, et al., 2003Pitarokili, Tzakou, et al., 2003Pourmortazavi, Sefidkon, et al., 2003Priestap, van Baren, et al., 2003
Comment MSDC-RI MSDC-RI MSDC-RI MSDC-RI MSDC-RI
Column type CapillaryCapillaryCapillaryCapillaryCapillary
Active phase NB-30HP-5MSHP-5DB-1DB-5
Column length (m) 50.30.30.60.30.
Carrier gas HeHeHeHeHe
Substrate
Column diameter (mm) 0.20.250.250.250.25
Phase thickness (μm) 0.50.250.250.250.25
Tstart (C) 50.60.60.50.60.
Tend (C) 250.275.280.280.240.
Heat rate (K/min) 2.4.4.4.3.
Initial hold (min)
Final hold (min)
I 1040.1051.1048.1046.1047.
ReferenceRaal, Arak, et al., 2003Sadraei, Ghannadi, et al., 2003Sajjadi and Mehregan, 2003Shahmir, Ahmadi, et al., 2003da Silva, Luz, et al., 2003
Comment MSDC-RI MSDC-RI MSDC-RI MSDC-RI MSDC-RI
Column type CapillaryCapillaryCapillaryCapillaryCapillary
Active phase HP-5HP-5HP-5DB-1HP-5
Column length (m) 60.60.60.50.25.
Carrier gas    N2H2
Substrate
Column diameter (mm) 0.250.250.250.250.32
Phase thickness (μm) 0.250.250.250.250.53
Tstart (C) 40.40.40.90.40.
Tend (C) 250.250.250.240.280.
Heat rate (K/min) 5.5.5.4.4.
Initial hold (min) 15.15.15.
Final hold (min)
I 1043.1043.1043.1038.1050.
ReferenceStashenko, Jaramillo, et al., 2003Stashenko, Jaramillo, et al., 2003Stashenko, Jaramillo, et al., 2003Velasco-Negueruela, Pérez-Alonso, et al., 2003Velickovic, Randjelovic, et al., 2003
Comment MSDC-RI MSDC-RI MSDC-RI MSDC-RI MSDC-RI
Column type CapillaryCapillaryCapillaryCapillaryCapillary
Active phase HP-5HP-5HP-5HP-5HP-5
Column length (m) 25.25.25.25.30.
Carrier gas H2HeliumHeliumHeliumHe
Substrate
Column diameter (mm) 0.320.320.320.320.25
Phase thickness (μm) 0.530.530.530.530.32
Tstart (C) 40.40.40.40.60.
Tend (C) 280.280.280.280.250.
Heat rate (K/min) 4.4.4.4.5.
Initial hold (min)     30.
Final hold (min)
I 1050.1044.1045.1050.1060.
ReferenceVelickovic, Randjelovic, et al., 2003Velickovic, Ristic, et al., 2003Velickovic, Ristic, et al., 2003Velickovic, Ristic, et al., 2003Yassa, Akhani, et al., 2003
Comment MSDC-RI MSDC-RI MSDC-RI MSDC-RI MSDC-RI
Column type CapillaryCapillaryCapillaryCapillaryCapillary
Active phase DB-5DB-1OV-101OV-101HP-1
Column length (m) 30.60.10.25.30.
Carrier gas HeHe  He
Substrate
Column diameter (mm) 0.250.250.250.320.25
Phase thickness (μm) 0.250.25  0.25
Tstart (C) 60.60.35.50.70.
Tend (C) 240.220.225.200.220.
Heat rate (K/min) 3.4.6.5.3.
Initial hold (min)   5.
Final hold (min)     15.
I 1048.1037.1049.1039.1035.
ReferenceZoghbi, Andrade, et al., 2003Baher, Mirza, et al., 2002Bloss, Acree, et al., 2002Boyom, Keumedjio, et al., 2002Cavaleiro, Salgueiro, et al., 2002
Comment MSDC-RI MSDC-RI MSDC-RI MSDC-RI MSDC-RI
Column type CapillaryCapillaryCapillaryCapillaryCapillary
Active phase 5 % Phenyl methyl siloxaneBP-1DB-5DB-1SE-30
Column length (m) 30.25.30.30.50.
Carrier gas HeN2HeH2He
Substrate
Column diameter (mm) 0.250.500.250.320.25
Phase thickness (μm) 0.250.250.250.250.25
Tstart (C) 75.60.60.40.70.
Tend (C) 200.220.240.245.240.
Heat rate (K/min) 3.5.3.3.4.
Initial hold (min) 4.  20.
Final hold (min) 8.10.
I 1050.1040.1051.1032.1037.
ReferenceCicció and Gómez-Laurito, 2002Das, Ram, et al., 2002Flamini, Ertugrul, et al., 2002Gancel, Ollé, et al., 2002Iñigo, Palá-Paúl, et al., 2002
Comment MSDC-RI MSDC-RI MSDC-RI MSDC-RI MSDC-RI
Column type CapillaryCapillaryCapillaryCapillaryCapillary
Active phase HP-5RSL-200RSL-200CP Sil 8 CBDB-5
Column length (m) 30.30.30.30.30.
Carrier gas  H2H2HeHe
Substrate
Column diameter (mm) 0.250.320.320.250.25
Phase thickness (μm)  0.250.250.250.25
Tstart (C) 50.40.50.50.35.
Tend (C) 200.280.280.220.280.
Heat rate (K/min) 3.6.6.3.4.
Initial hold (min)  5.5.2.2.
Final hold (min)  5.5. 15.
I 1049.1038.1037.1047.1051.
ReferenceIsidorov and Jdanova, 2002Jirovetz, Buchbauer, et al., 2002Jirovetz, Ngassoum, et al., 2002Juteau, Masotti, et al., 2002Krauze-Baranowska, Mardarowicz, et al., 2002
Comment MSDC-RI MSDC-RI MSDC-RI MSDC-RI MSDC-RI
Column type CapillaryCapillaryCapillaryCapillaryCapillary
Active phase OV-101DB-5DB-5DB-5MSDB-1
Column length (m) 25.30.30.30.30.
Carrier gas HeHeHeHeHe
Substrate
Column diameter (mm) 0.320.320.250.250.25
Phase thickness (μm)  0.250.250.250.25
Tstart (C) 50.40.60.60.60.
Tend (C) 200.290.240.240.250.
Heat rate (K/min) 5.7.3.3.4.
Initial hold (min)     10.
Final hold (min)
I 1039.1049.1049.1046.1047.
ReferenceKuiate, Bessière, et al., 2002Lin, Rouseff, et al., 2002Maia, da Silva, et al., 2002Maia, Zoghbi, et al., 2002Norouzi-Arasi, Yavari, et al., 2002
Comment MSDC-RI MSDC-RI MSDC-RI MSDC-RI MSDC-RI
Column type CapillaryCapillaryCapillaryCapillaryCapillary
Active phase OV-101HP-1DB-5DB-1DB-1
Column length (m) 50.50.25.60.50.
Carrier gas HeN2HeHeN2
Substrate
Column diameter (mm) 0.20.250.20.250.25
Phase thickness (μm) 0.50.25 0.250.25
Tstart (C) 50.90.60.40.60.
Tend (C) 250.220.220.280.240.
Heat rate (K/min) 2.3.3.4.3.
Initial hold (min)    5.
Final hold (min)
I 1037.1046.1045.1037.1017.
ReferenceOrav, Kailas, et al., 2002Priestap, van Baren, et al., 2002Schwob, Bessière, et al., 2002Sefidkon, 2002Velasco-Negueruela, Pérez-Alonso, et al., 2002
Comment MSDC-RI MSDC-RI MSDC-RI MSDC-RI MSDC-RI
Column type CapillaryCapillaryCapillaryCapillaryCapillary
Active phase DB-5MSDB-5SPB-5DB-5MSDB-5MS
Column length (m) 30.30.60.60.60.
Carrier gas HeHeHeHeHe
Substrate
Column diameter (mm) 0.250.250.320.250.25
Phase thickness (μm) 0.250.25 0.250.25
Tstart (C) 60.60.40.35.35.
Tend (C) 270.240.220.250.250.
Heat rate (K/min) 3.3.3.3.3.
Initial hold (min)   5.5.5.
Final hold (min)   15.
I 1046.1051.1051.1050.1051.
ReferenceZoghbi, Andrade, et al., 2002Zoghbi, Andrade, et al., 2002, 2Cornu, Carnat, et al., 2001Fernando and Grün, 2001Fernando and Grün, 2001
Comment MSDC-RI MSDC-RI MSDC-RI MSDC-RI MSDC-RI
Column type CapillaryCapillaryCapillaryCapillaryCapillary
Active phase HP-5HP-5BP-1RSL-200BP-1
Column length (m) 30.30.30.30.50.
Carrier gas N2N2N2H2He
Substrate
Column diameter (mm) 0.250.250.250.320.22
Phase thickness (μm) 0.250.250.250.250.25
Tstart (C) 60.60.60.40.60.
Tend (C) 220.220.220.280.230.
Heat rate (K/min) 5.5.5.6.2.
Initial hold (min) 10.10. 5.
Final hold (min)    5.35.
I 1051.1052.1042.1040.1035.
ReferenceFlamini, Cioni, et al., 2001Gallori, Flamini, et al., 2001Gupta, Mallavarapu, et al., 2001Jirovetz L., Buchbauer G., et al., 2001Lota, de Rocca Serra, et al., 2001
Comment MSDC-RI MSDC-RI MSDC-RI MSDC-RI MSDC-RI
Column type CapillaryCapillaryCapillaryCapillaryCapillary
Active phase DB-5MSDB-1OV-101OV-101DB-1
Column length (m) 30.60.50.50.30.
Carrier gas HeHeHeHeN2
Substrate
Column diameter (mm) 0.250.250.20.20.25
Phase thickness (μm) 0.250.250.5 0.25
Tstart (C) 60.50.50.50.80.
Tend (C) 240.270.250.250.225.
Heat rate (K/min) 3.4.2.2.4.
Initial hold (min)
Final hold (min) 30.
I 1058.1036.1038.1039.1027.
ReferenceMarongiu, Porcedda, et al., 2001Mirza, Ahmadi, et al., 2001Orav, Kailas, et al., 2001Orav and Kann, 2001Palá-Paúl, Pérez-Alonso, et al., 2001
Comment MSDC-RI MSDC-RI MSDC-RI MSDC-RI MSDC-RI
Column type CapillaryCapillaryCapillaryCapillaryCapillary
Active phase DB-5DB-5DB-1DB-5SPB-1
Column length (m) 30.30.30.30.30.
Carrier gas  H2HeHeHe
Substrate
Column diameter (mm) 0.320.250.20.250.32
Phase thickness (μm) 0.50.25 0.250.25
Tstart (C) 35.60.60.60.50.
Tend (C) 275.285.240.240.250.
Heat rate (K/min) 6.3.3.3.2.
Initial hold (min)
Final hold (min)
I 1050.1044.1050.51050.1045.
ReferenceRouseff, Jella, et al., 2001Santos-Gomes and Fernandes-Ferreira, 2001Santos, Moreira, et al., 2001Tellez M., Estell R., et al., 2001Vijayanand, Rao, et al., 2001
Comment MSDC-RI MSDC-RI MSDC-RI MSDC-RI MSDC-RI
Column type CapillaryCapillaryCapillaryCapillaryCapillary
Active phase SPB-1RSL-200DB-5DB-1DB-5
Column length (m) 30.60.30.25.30.
Carrier gas HeH2HeNitrogenN2
Substrate
Column diameter (mm) 0.20.320.250.500.22
Phase thickness (μm) 0.20.250.250.250.25
Tstart (C) 80.40.60.60.70.
Tend (C) 300.250.240.220.230.
Heat rate (K/min) 5.6.3.5.4.
Initial hold (min) 3.   2.
Final hold (min)     20.
I 1052.1040.1048.1040.1047.
ReferenceFraternale, Giamperi, et al., 2000Jirovetz, Puschmann, et al., 2000Maia, Zoghbi, et al., 2000Mallavarapu, Rao, et al., 2000Mitiku, Sawamura, et al., 2000
Comment MSDC-RI MSDC-RI MSDC-RI MSDC-RI MSDC-RI
Column type CapillaryCapillaryCapillaryCapillaryCapillary
Active phase BP-1HP-5DB-1OV-101SE-30
Column length (m) 25.30.30.50.25.
Carrier gas N2HeHeNitrogenHe
Substrate
Column diameter (mm) 0.330.250.250.250.2
Phase thickness (μm) 1.00.250.25
Tstart (C) 60.60.40.40.60.
Tend (C) 275.275.260.200.230.
Heat rate (K/min) 4.4.2.2.3.
Initial hold (min)   5.10.
Final hold (min)   2.
I 1048.1048.1034.1038.1052.
ReferenceMohagheghzadeh, Shams-Ardakani, et al., 2000Mohagheghzadeh, Shams-Ardakani, et al., 2000, 2Senatore, Napolitano, et al., 2000Tamura, Boonbumrung, et al., 2000Ali N.A.M. and Jantan, 1999
Comment MSDC-RI MSDC-RI MSDC-RI MSDC-RI MSDC-RI
Column type CapillaryCapillaryCapillaryCapillaryCapillary
Active phase OV-1OV-1OV-1OV-101RTX-1
Column length (m) 25.25.25.52.30.
Carrier gas HydrogenHydrogenHydrogenHeliumN2
Substrate
Column diameter (mm) 0.320.320.320.260.25
Phase thickness (μm) 0.300.300.300.130.25
Tstart (C) 50.50.50.50.60.
Tend (C) 200.200.200.220.300.
Heat rate (K/min) 3.3.3.3.4.
Initial hold (min) 1.1.1.0.
Final hold (min) 10.10.10.0.
I 1034.1034.1034.1026.1042.
ReferenceBicchi, Binello, et al., 1999Bicchi, Binello, et al., 1999Bicchi, Binello, et al., 1999Dzumayev, Tkachenko, et al., 1999Kalemba, 1999
Comment MSDC-RI MSDC-RI MSDC-RI MSDC-RI MSDC-RI
Column type CapillaryCapillaryCapillaryCapillaryCapillary
Active phase OV-101CBP-1HP-1SE-30OV-1
Column length (m) 25.25.25.25.25.
Carrier gas  HeH2HeH2
Substrate
Column diameter (mm) 0.320.30.320.20.25
Phase thickness (μm)   0.17 0.25
Tstart (C) 50.60.40.60.40.
Tend (C) 200.240.260.230.220.
Heat rate (K/min) 5.4.3.3.3.
Initial hold (min)   5.10.5.
Final hold (min)     5.
I 1039.1040.1038.1052.1039.
ReferenceKuiate, Zollo, et al., 1999Labuckas, Zygadlo, et al., 1999Lopes, Koketsu, et al., 1999Mohd and Jantan, 1999Oberhofer, Nikiforov, et al., 1999
Comment MSDC-RI MSDC-RI MSDC-RI MSDC-RI MSDC-RI
Column type CapillaryCapillaryCapillaryCapillaryCapillary
Active phase OV-1DB-1OV-101DB-5SE-30
Column length (m) 25.50.50.30.30.
Carrier gas H2HeHeHeHelium
Substrate
Column diameter (mm) 0.250.250.250.250.25
Phase thickness (μm) 0.250.250.250.250.20
Tstart (C) 40.70.70.40.60.
Tend (C) 220.240.220.250.200.
Heat rate (K/min) 3.4.2.2.3.
Initial hold (min) 5. 5.5.4.
Final hold (min) 5.  60.
I 1044.1027.1035.1046.1047.
ReferenceOberhofer, Nikiforov, et al., 1999Palá-Paúl, Pérez-Alonso, et al., 1999Pateira, Nogueira, et al., 1999Porta, Porcedda, et al., 1999Prikhod'ko, Klyuev, et al., 1999
Comment MSDC-RI MSDC-RI MSDC-RI MSDC-RI MSDC-RI
Column type CapillaryCapillaryCapillaryCapillaryCapillary
Active phase SE-30Ultra-2BP-1DB-1DB-5
Column length (m) 30.25.25.60.30.
Carrier gas Helium N2HeHe
Substrate
Column diameter (mm) 0.250.20.50.250.25
Phase thickness (μm) 0.20  0.250.25
Tstart (C) 60.40.60.40.40.
Tend (C) 200.300.220.280.220.
Heat rate (K/min) 3.5.5.4.4.
Initial hold (min) 4.4. 5.5.
Final hold (min)   10.
I 1092.1046.1044.1038.1047.
ReferencePrikhod'ko, Klyuev, et al., 1999Quiroz, Fuentes-Contreras, et al., 1999Rao, Bhattacharya, et al., 1999Sefidkon, Dabiri, et al., 1999Sefidkon and Khajavi, 1999
Comment MSDC-RI MSDC-RI MSDC-RI MSDC-RI MSDC-RI
Column type CapillaryCapillaryCapillaryCapillaryCapillary
Active phase DB-1DB-5OV-101DB-5DB-5MS
Column length (m) 60.30.25.30.30.
Carrier gas HeHeNitrogenHeHe
Substrate
Column diameter (mm) 0.250.250.200.250.25
Phase thickness (μm) 0.250.25 0.250.25
Tstart (C) 50.60.60.60.60.
Tend (C) 220.240.220.240.240.
Heat rate (K/min) 4.3.4.3.3.
Initial hold (min)   0.
Final hold (min)   0.
I 1047.1051.1025.1047.1048.
ReferenceSefidkon and Mirza, 1999Tellez, Canel, et al., 1999Tropnikova, Zenkevich, et al., 1999Zoghbi, Andrade, et al., 1999Zoghbi, Andrade, et al., 1999, 2
Comment MSDC-RI MSDC-RI MSDC-RI MSDC-RI MSDC-RI
Column type CapillaryCapillaryCapillaryCapillaryCapillary
Active phase SPB-5OV-1DB-5HP-5HP-1
Column length (m) 50.50.30.25.60.
Carrier gas HeHeHeHeHe
Substrate
Column diameter (mm) 0.320.320.250.20.25
Phase thickness (μm) 0.250.250.250.330.25
Tstart (C) 60.50.60.70.50.
Tend (C) 240.250.240.290.280.
Heat rate (K/min) 3.10.3.3.4.
Initial hold (min)  5. 8.5.
Final hold (min) 20.20. 20.
I 1043.1041.1048.1050.1046.
ReferenceDoneanu and Anitescu, 1998Kökdil, Kurucu, et al., 1998Maia, Zohhbi, et al., 1998Poiana, Sicari, et al., 1998Stashenko, Cervantes, et al., 1998
Comment MSDC-RI MSDC-RI MSDC-RI MSDC-RI MSDC-RI
Column type CapillaryCapillaryCapillaryCapillaryCapillary
Active phase OV-101OV-1SPB-SulfurSPB-SulfurDB-1
Column length (m) 25.30.30.30.
Carrier gas  HeHeHe
Substrate
Column diameter (mm) 0.320.320.320.32
Phase thickness (μm)  0.254.4.
Tstart (C) 50.40.45.45.80.
Tend (C) 200.270.240.240.220.
Heat rate (K/min) 5.2.5.5.6.
Initial hold (min)  4.13.13.
Final hold (min)   5.5.
I 1042.1056.1040.1042.1027.
ReferenceZollo, Biyiti, et al., 1998Kökdil, Kurucu, et al., 1997Mariaca, Berger, et al., 1997Mariaca, Berger, et al., 1997Salgueiro, Vila, et al., 1997
Comment MSDC-RI MSDC-RI MSDC-RI MSDC-RI MSDC-RI
Column type CapillaryCapillaryCapillaryCapillaryCapillary
Active phase DB-5DB-5HP-1OV-101DB-5
Column length (m) 30.30.23.50.30.
Carrier gas HeliumHeHeN2
Substrate
Column diameter (mm) 0.250.250.320.250.25
Phase thickness (μm) 0.25 0.170.170.25
Tstart (C) 60.60.60.50.60.
Tend (C) 240.240.250.220.300.
Heat rate (K/min) 3.4.5.5.4.
Initial hold (min)   3. 2.
Final hold (min)   30. 5.
I 1050.1050.1038.1041.1045.0
ReferenceTellez, Estell, et al., 1997Zunino, Novillo-Newton, et al., 1997Ayedoun, Adeoti, et al., 1996Chacko, Jayalekshmy, et al., 1996Gawdzik, Mardarowicz, et al., 1996
Comment MSDC-RI MSDC-RI MSDC-RI MSDC-RI MSDC-RI
Column type CapillaryCapillaryCapillaryCapillaryCapillary
Active phase OV-101BP-1BP-1BP-1DB-1
Column length (m) 50.25.25.25.60.
Carrier gas HeN2N2N2He
Substrate
Column diameter (mm) 0.250.500.500.500.32
Phase thickness (μm)     0.50
Tstart (C) 50.60.60.60.50.
Tend (C) 250.220.220.220.250.
Heat rate (K/min) 2.5.5.5.8.
Initial hold (min)     1.
Final hold (min)     6.
I 1037.1042.1044.1046.1042.
ReferenceOrav, Kailas, et al., 1996Rajeswara, Kaul, et al., 1996Rajeswara, Kaul, et al., 1996Rajeswara, Kaul, et al., 1996Sagrero-Nieves and Bartley, 1996
Comment MSDC-RI MSDC-RI MSDC-RI MSDC-RI MSDC-RI
Column type CapillaryCapillaryCapillaryCapillaryCapillary
Active phase DB-1SPB-1OV-101DB-1DB-1
Column length (m) 60.50.52.60.60.
Carrier gas HeHeHeHeHe
Substrate
Column diameter (mm) 0.250.20.260.250.25
Phase thickness (μm) 0.250.33 0.250.25
Tstart (C) 50.40.50.50.70.
Tend (C) 250.200.220.250.270.
Heat rate (K/min) 2.53.3.3.52.5
Initial hold (min) 5.3. 5.5.
Final hold (min)  30.
I 1047.1040.1039.1037.1035.
ReferenceStashenko, Puertas, et al., 1996Wong and Lai, 1996Dzumayev, Tsibulskaya, et al., 1995Stashenko, Torres, et al., 1995Tirado, Stashenko, et al., 1995
Comment MSDC-RI MSDC-RI MSDC-RI MSDC-RI MSDC-RI
Column type CapillaryCapillaryCapillaryCapillaryCapillary
Active phase DB-1HP-101Methyl SiliconeMethyl SiliconeMethyl Silicone
Column length (m) 60.50.50.50.25.
Carrier gas HeH2N2N2
Substrate
Column diameter (mm) 0.250.320.250.250.50
Phase thickness (μm) 0.250.30.170.17
Tstart (C) 70.65.80.80.60.
Tend (C) 270.300.200.200.220.
Heat rate (K/min) 2.52.2.3.5.
Initial hold (min) 5.5.
Final hold (min)
I 1035.1035.1038.1045.1042.
ReferenceTirado, Stashenko, et al., 1995Demarne and van der Walt, 1993Gopalakrishnan, Menon, et al., 1993Gopalakrishnan, Menon, et al., 1993Mallavarapu, Ramesh, et al., 1993
Comment MSDC-RI MSDC-RI MSDC-RI MSDC-RI MSDC-RI
Column type CapillaryCapillaryCapillaryCapillaryCapillary
Active phase SE-54BP-1DB-1BP-1SE-30
Column length (m) 30.25.60.50.40.
Carrier gas Hydrogen  H2He
Substrate
Column diameter (mm) 0.250.330.320.300.50
Phase thickness (μm) 0.25   0.75
Tstart (C) 60.45.50.40.30.
Tend (C) 250.180.250.250.220.
Heat rate (K/min) 2.3.4.10.3.
Initial hold (min) 5.3.0.11.
Final hold (min) 2. 5.
I 1050.1039.1037.1040.1037.
ReferenceKollmannsberger, Nitz, et al., 1992Wyllie, Brophy, et al., 1990Binder and Flath, 1989Brophy, Davies, et al., 1989de Pooter, de Buyck, et al., 1989
Comment MSDC-RI MSDC-RI MSDC-RI MSDC-RI MSDC-RI
Column type CapillaryCapillaryCapillaryCapillaryCapillary
Active phase DB-1DB-1OV-1OV-1OV-3
Column length (m) 60.60.50.60.150.
Carrier gas HeHeHeHeliumHe
Substrate
Column diameter (mm) 0.320.320.200.500.66
Phase thickness (μm)   0.201.2
Tstart (C) 30.30.30.40.30.
Tend (C) 210.210.220.220.170.
Heat rate (K/min) 2.2.2.2.1.
Initial hold (min) 4.4.
Final hold (min)
I 1037.1041.1037.1037.1050.
ReferenceTakeoka and Butter, 1989Takeoka and Butter, 1989de Pooter, Nicolai, et al., 1988Wahab, Aboutabl, et al., 1987Buttery, Flath, et al., 1986
Comment MSDC-RI MSDC-RI MSDC-RI MSDC-RI MSDC-RI
Column type CapillaryCapillaryCapillaryCapillaryCapillary
Active phase OV-101OV-101OV-101OV-1OV-101
Column length (m) 50.50.50.40.30.
Carrier gas    HeHe
Substrate
Column diameter (mm) 0.300.300.300.50.5
Phase thickness (μm)    0.750.8
Tstart (C) 40.40.40.30.40.
Tend (C) 230.230.230.220.220.
Heat rate (K/min) 3.53.53.53.2.
Initial hold (min) 5.5.5.
Final hold (min)
I 1040.1041.1051.1037.1038.
ReferenceNykanen, 1986Nykanen, 1986Nykanen, 1986de Pooter, de Buyck, et al., 1986De Pooter and Schamp, 1986
Comment MSDC-RI MSDC-RI MSDC-RI MSDC-RI MSDC-RI
Column type CapillaryCapillaryCapillaryCapillary
Active phase OV-101OV-101OV-3DB-1
Column length (m) 30.30.150.60.
Carrier gas HeHe
Substrate
Column diameter (mm) 0.50.50.660.32
Phase thickness (μm) 0.80.8
Tstart (C) 40.40.20.50.
Tend (C) 220.220.170.250.
Heat rate (K/min) 2.2.1.4.
Initial hold (min)    0.1
Final hold (min)    5.
I 1037.1038.1050.1036.
ReferenceDe Pooter and Schamp, 1986De Pooter and Schamp, 1986Buttery, Xu, et al., 1985Flath, Mon, et al., 1983
Comment MSDC-RI MSDC-RI MSDC-RI MSDC-RI

Van Den Dool and Kratz RI, polar column, custom temperature program

Data compiled by: NIST Mass Spectrometry Data Center, William E. Wallace, director

Column type CapillaryCapillaryCapillaryCapillaryCapillary
Active phase Supelcowax-10Supelcowax-10Carbowax 20MStabilwaxDB-Wax
Column length (m) 30.30.25.30.30.
Carrier gas  HeH2HeHe
Substrate
Column diameter (mm) 0.250.250.320.320.25
Phase thickness (μm) 0.250.250.251.0.25
Program 35C(8min) => 4C/min => 60C => 6C/min => 160C => 20C/min => 220C(1min)35C(8min) => 4C/min => 60C => 6C/min => 160C => 20C/min => 200C(1min)40C(8min) => 3C/min => 180C => 20C/min => 230C(10min)40C(2min) => 5C/min => 100C => 4C/min => 230C (10min)40 (5min) => 4C/min => 140C => 4C/min => 200C (20min)
I 1250.1250.1200.1240.1243.
ReferenceBianchi, Cantoni, et al., 2007Bianchi, Careri, et al., 2007Lorenzo, Paz, et al., 2005Wang, Finn, et al., 2005Zheng, Kim, et al., 2005
Comment MSDC-RI MSDC-RI MSDC-RI MSDC-RI MSDC-RI
Column type CapillaryCapillaryCapillaryCapillaryCapillary
Active phase DB-WaxRTX-WaxCarbowax 20MDB-WaxBP-20
Column length (m) 30. 25.30.25.
Carrier gas He H2HeHe
Substrate
Column diameter (mm) 0.25 0.320.250.25
Phase thickness (μm) 0.25 0.250.50.25
Program 40 (5min) => 4C/min => 140C => 4C/min => 200C (20min)not specified40C(8min) => 3C/min => 180C => 20C/min => 230C40C(2min) => 2C/min => 100C => 10C/min => 230C (5min)40C(8min) => 3C/min => 180C => 20C/min => 230C
I 1240.1239.1244.1256.1256.
ReferenceZheng, Kim, et al., 2005Dugo, Mondello, et al., 2004Frizzo, Lorenzo, et al., 2004Klesk and Qian, 2003Lorenzo, Loayza, et al., 2003
Comment MSDC-RI MSDC-RI MSDC-RI MSDC-RI MSDC-RI
Column type CapillaryCapillaryCapillaryCapillaryCapillary
Active phase BP-20Carbowax 20MRTX-WaxCarbowax 20MCarbowax 20M
Column length (m) 25.25.60.25.25.
Carrier gas HeH2 H2H2
Substrate
Column diameter (mm) 0.250.320.250.320.32
Phase thickness (μm) 0.250.250.250.250.25
Program 40 0C (8 min) 3 K/min -> 180 0C 20 K/min -> 230 0C40C(8min) => 3C/min => 180C => 20C/min => 230Cnot specified40 0C (8 min) 3 K/min -> 180 0C 20 K/min -> 230 0C40 0C (8 min) 3 K/min -> 180 0C 20 K/min -> 230 0C
I 1200.1200.1249.1200.1251.
ReferenceLorenzo, Loayza, et al., 2002Lorenzo, Paz, et al., 2002Cavalli, Ranarivelo, et al., 2001Lorenzo, Paz, et al., 2001Lorenzo, Saavedra, et al., 2001
Comment MSDC-RI MSDC-RI MSDC-RI MSDC-RI MSDC-RI
Column type CapillaryCapillaryCapillaryCapillaryCapillary
Active phase DB-WaxBP-20FFAPHP-InnowaxHP-Innowax
Column length (m) 30. 30.30.60.
Carrier gas H2 HeHeHe
Substrate
Column diameter (mm) 0.25 0.320.250.25
Phase thickness (μm) 0.25 0.250.250.25
Program 60 0C (3 min) 2 K/min -> 220 0C 5 K/min -> 250 0C (15 min)not specified35C (2min) => 40C/min => 60C (2min) => 6C/min => 180C => 10C/min => 230C (5min)60C(8min) => 3C/min => 180C(5min) => 40C/min => 250C32C(1.5min) => 3C/min => 40C (10min) => 3C/min => 200C (10min)
I 1239.1246.1250.1250.1259.
ReferenceBoulanger and Crouzet, 2000Filippini, Tomi, et al., 2000Tairu, Hofmann, et al., 1999Bisio, Ciarallo, et al., 1998Iversen, Jakobsen, et al., 1998
Comment MSDC-RI MSDC-RI MSDC-RI MSDC-RI MSDC-RI

Kovats' RI, polar column, isothermal

Data compiled by: NIST Mass Spectrometry Data Center, William E. Wallace, director

Column type CapillaryCapillaryCapillaryCapillaryPacked
Active phase Carbowax 20MCarbowax 20MCarbowax 20MCarbowax 20MCarbowax 4000
Column length (m)    150.6.1
Carrier gas     N2
Substrate     Gas Chrom P (60-80 mesh)
Column diameter (mm)    0.75
Phase thickness (μm) 0.50.50.5
Temperature (C) 100.70.90.70.130.
I 1244.1241.71240.11257.1273.
ReferenceSaeed, Redant, et al., 1979Saeed, Redant, et al., 1979Saeed, Redant, et al., 1979Malingré and Maarse, 1974Minyard, Tumlinson, et al., 1965
Comment MSDC-RI MSDC-RI MSDC-RI MSDC-RI MSDC-RI

Van Den Dool and Kratz RI, non-polar column, custom temperature program

Data compiled by: NIST Mass Spectrometry Data Center, William E. Wallace, director

Column type CapillaryCapillaryCapillaryCapillaryCapillary
Active phase DB-5BPX-5SE-52DB-5SE-52
Column length (m) 30.30.30. 30.
Carrier gas He He He
Substrate
Column diameter (mm) 0.250.250.32 0.32
Phase thickness (μm) 0.250.250.15 0.15
Program 40C(2min) => 4C/min => 220C => 20C/min => 280C35C(5min) => 3C/min => 210C => 40C/min => 240C (4min)45C => 1C/min => 100C => 5C/min => 250C (10min)not specified45C => 1C/min => 100C => 5C/min => 250C(10min)
I 1047.1054.1051.1038.1050.
ReferenceAndrade, Sampaio, et al., 2007Cardeal, da Silva, et al., 2006Guerrini, Sacchetti, et al., 2006Özel, Gögüs, et al., 2006Sacchetti, Guerrini, et al., 2006
Comment MSDC-RI MSDC-RI MSDC-RI MSDC-RI MSDC-RI
Column type CapillaryCapillaryCapillaryCapillaryCapillary
Active phase SE-52SE-525 % Phenyl methyl siloxaneDB-5DB-5MS
Column length (m) 30.25.30.30.30.
Carrier gas HeH2HeHeHe
Substrate
Column diameter (mm) 0.320.320.320.320.25
Phase thickness (μm) 0.150.430.151.0.25
Program 45C => 1C/min => 100C => 5C/min => 250C(10min)60C(8min) => 3C/min => 180C => 20C/min => 250C(10min)45C => 1C/min => 100C => 5C/min => 250C (10min)40C(2min) => 5C/min => 100C => 4C/min => 230C (10min)40 (5min) => 4C/min => 140C => 4C/min => 200C (20min)
I 1051.1045.1050.1038.1046.
ReferenceBruni, Pellati, et al., 2005Lorenzo, Paz, et al., 2005Sacchetti, Maietti, et al., 2005Wang, Finn, et al., 2005Zheng, Kim, et al., 2005
Comment MSDC-RI MSDC-RI MSDC-RI MSDC-RI MSDC-RI
Column type CapillaryCapillaryCapillaryCapillaryCapillary
Active phase DB-5MSSE-52DB-5SE-52SE-52
Column length (m) 30.25.30.25.30.
Carrier gas HeH2He He
Substrate
Column diameter (mm) 0.250.320.320.320.52
Phase thickness (μm) 0.250.431.0.40.15
Program 40 (5min) => 4C/min => 140C => 4C/min => 200C (20min)60C(8min) => 3C/min => 180C => 20C/min => 250C(10min)40C (2min) => 5C/min => 100C => 4C/min => 230C (10min)60C(8min) => 3C/min => 180C => 20C/min => 250C(10min)45C => 1C/min => 100C => 5C/min => 250C (10min)
I 1044.1049.1043.1049.1050.
ReferenceZheng, Kim, et al., 2005Frizzo, Lorenzo, et al., 2004Klesk, Qian, et al., 2004Lorenzo, Paz, et al., 2004Sacchetti, Medici, et al., 2004
Comment MSDC-RI MSDC-RI MSDC-RI MSDC-RI MSDC-RI
Column type CapillaryCapillaryCapillaryCapillaryCapillary
Active phase DB-5MSDB-5SE-52SE-52SE-52
Column length (m) 30.30.25.25.30.
Carrier gas HeHeHeH2H2
Substrate
Column diameter (mm) 0.250.250.250.320.32
Phase thickness (μm) 0.250.250.250.400.42
Program 40C(5min) => 4C/min => 160C => 8C/min => 240C (15min)40C(2min) => 5C/min => 100C => 4C/min => 230C(10min)60C(8min) => 3C/min => 180C => 20C/min => 230C60 C (8 min) 3 C/min -> 180 C 20 C/min -> 250 C (10 min)60C(8min) => 3C/min => 180C => 20C/min => 250C(10min)
I 1048.1042.1045.1046.1048.
ReferenceKim, Lee, et al., 2003Klesk and Qian, 2003Lorenzo, Loayza, et al., 2003Lorenzo, Loayza, et al., 2002Lorenzo, Paz, et al., 2002
Comment MSDC-RI MSDC-RI MSDC-RI MSDC-RI MSDC-RI
Column type CapillaryCapillaryCapillaryCapillaryCapillary
Active phase BP-1CP Sil 8 CBSE-52DB-5MSBP-1
Column length (m) 50.60.30.30.
Carrier gas   H2He
Substrate
Column diameter (mm) 0.220.250.320.25
Phase thickness (μm) 0.250.250.400.25
Program not specified0C => rapidly => 40C(8min) => 4C/min => 250C(10min)60 0C (8 min) 3 K/min -> 180 0C 20 K/min -> 250 0C (10 min)60 0C (3 min) 2 K/min -> 220 0C 5 K/min -> 250 0C (15 min)not specified
I 1037.1051.1048.1055.1037.
ReferenceCavalli, Ranarivelo, et al., 2001Duckham, Dodson, et al., 2001Lorenzo, Paz, et al., 2001Boulanger and Crouzet, 2000Filippini, Tomi, et al., 2000
Comment MSDC-RI MSDC-RI MSDC-RI MSDC-RI MSDC-RI
Column type CapillaryCapillaryCapillary
Active phase DB-5DB-5SE-52
Column length (m) 30.30.25.
Carrier gas H2H2He
Substrate
Column diameter (mm) 0.250.250.25
Phase thickness (μm) 0.250.250.25
Program 40C(5min) => 2C/min => 220C => 5C/min => 250C(15min)40C(5min) => 2C/min => 220C => 5C/min => 250C(15min)60 0C (8 min) 3 K/min -> 180 0C 20 K/min -> 230 0C
I 1047.1050.1038.
ReferenceBoulanger, Chassagne, et al., 1999Boulanger, Chassagne, et al., 1999Loayza, de Groot, et al., 1999
Comment MSDC-RI MSDC-RI MSDC-RI

Kovats' RI, non-polar column, isothermal

Data compiled by: NIST Mass Spectrometry Data Center, William E. Wallace, director

Column type CapillaryPackedPackedPackedPacked
Active phase DB-1OV-101OV-101OV-101OV-101
Column length (m) 28.2.2.2.2.
Carrier gas HeArArArAr
Substrate  W-AW-DMCSW-AW-DMCSW-AW-DMCSW-AW-DMCS
Column diameter (mm) 0.25
Phase thickness (μm) 0.25
Temperature (C) 150.130.140.150.160.
I 1036.1040.1041.1042.1043.
ReferenceViswanathan, Maridass, et al., 2002Szabolcs, Benecke, et al., 1985Szabolcs, Benecke, et al., 1985Szabolcs, Benecke, et al., 1985Szabolcs, Benecke, et al., 1985
Comment MSDC-RI MSDC-RI MSDC-RI MSDC-RI MSDC-RI
Column type CapillaryCapillaryCapillaryCapillaryCapillary
Active phase OV-101OV-101OV-101OV-101SE-30
Column length (m)     80.
Carrier gas
Substrate
Column diameter (mm)     0.5
Phase thickness (μm)     0.8
Temperature (C) 130.140.150.160.100.
I 1036.1040.1045.1049.1026.7
ReferenceBenecke, Thieme, et al., 1982Benecke, Thieme, et al., 1982Benecke, Thieme, et al., 1982Benecke, Thieme, et al., 1982Saeed, Redant, et al., 1979
Comment MSDC-RI MSDC-RI MSDC-RI MSDC-RI MSDC-RI
Column type CapillaryCapillaryPacked
Active phase SE-30SE-30Apiezon L
Column length (m) 80.80.6.1
Carrier gas   N2
Substrate   Gas Chrom P (60-80 mesh)
Column diameter (mm) 0.50.5
Phase thickness (μm) 0.80.8
Temperature (C) 110.130.130.
I 1027.11027.11048.
ReferenceSaeed, Redant, et al., 1979Saeed, Redant, et al., 1979Minyard, Tumlinson, et al., 1965
Comment MSDC-RI MSDC-RI MSDC-RI

References

Sardashti, Valizadeh, et al., 2013
Sardashti, A.R.; Valizadeh, J.; Adhami, Y., Variations in the essential oil composition of Peroskia abrotonolides of different growth stage in Baluchestan, Middle-East J. Sci. Res., 2013, 13, 6, 781-784. [all data]

Bendiabdellah, El Amine Dib, et al., 2012
Bendiabdellah, A.; El Amine Dib, M.; Djabou, N.; Allali, H.; Tabti, B.; Costa, J.; Myseli, A., Biological activities and volatile cinstituents of Daucus muricatus L. from Algeria, Chem. Centr. J., 2012, 6, 48, 1-22. [all data]

Dell'Agli, Sanna, et al., 2012
Dell'Agli, M.; Sanna, C.; Rubiolo, P.; BAsilico, N.; Colombo, E.; Scaltrito, M.M.; Ndiath, M.O.; Maccarone, L.; Taramelli, D.; Bicchi, C.; Ballero, M.; Bosisio, E., Anti-plasmodial and insecticidal activities of the essential oils of aromatic plants growing in the Mediterranian area, Malaria Journal, 2012, 11, 1, 219-228, https://doi.org/10.1186/1475-2875-11-219 . [all data]

Jian-Yu, Zhu, et al., 2012
Jian-Yu, S.; Zhu, L.; Tian, Y.-J., Chemical composition and antimicrobial activities of essential oil of Matricaria songarica, Int. J. Agriculture Biology, 2012, 14, 1, 107-110. [all data]

Phungpanya, Thongpoon, et al., 2012
Phungpanya, C.; Thongpoon, C.; Pripdeevech, P.; Machan, T., Analysis of aroma volatiles from fresh leaves of Plectranthus amboinicus using solid phase microextraction (SPME) technique, Pure and Applied Chemistry International Conference 2012 (PACCON 2012), 2012, 16701672. [all data]

Velickovic, Ristic, et al., 2012
Velickovic, D.T.; Ristic, M.S.; Karabegovic, I.T.; Stojicevic, S.S.; Lazic, M.L., The influence of the distillation method on the chemical composition of the essential oil of sage (Salvia officinalis L.), Advanced Technologies, 2012, 1, 1, 47-51. [all data]

Zouari, Ayadi, et al., 2012
Zouari, N.; Ayadi, I.; Fakhfakh, N.; Rebai, A.; Zouari, S., Variations of chemical composition of essential oils in wild-populations of Thymus algeriensis Boiss et Reut., a North African endemic species, Lipids in Health and Desease, 2012, 11, 1, 28-39, https://doi.org/10.1186/1476-511X-11-28 . [all data]

Bertoli, Lepnardi, et al., 2011
Bertoli, A.; Lepnardi, M.; Krzyzanowska, J.; Oleszek, W.; Pistelli, L., Mentha longifolia in vitro cultures as safe source of flavouring ingradients, Acta Biochem. Polonica, 2011, 58, 4, 581-587. [all data]

Cao, Li, et al., 2011
Cao, H.; Li, Z.; Chen, X., QSRR study of GC retention indices of volatile compounds emitted from Mosla chinensis Maxim. by multiply linear regression, Chin. J. Chem., 2011, 29, 10, 2187-2196, https://doi.org/10.1002/cjoc.201180379 . [all data]

Esseien, Aboaba, et al., 2011
Esseien, E.E.; Aboaba, S.O.; Ogunwande, I.A., Constituents and antimicrobial properties of the leaf essential oil of Gossypium barbadense (Linn.), J. Med. Plant Res., 2011, 5, 5, 702-705. [all data]

Kahriman, Tosun, et al., 2011
Kahriman, N.; Tosun, G.; Terzioglu, S.; Karaoglu, S.A.; Yayh, N., Chemical composition and antimicrobial activity of the essential oils from the flower, leaf, and stem of Senecio pandurifolis, Rec. Nat. Prod., 2011, 5, 2, 82-91. [all data]

Menichini, Tundis, et al., 2011
Menichini, F.; Tundis, R.; Bonesi, M.; de Cindio, B.; Loizzo, M.R.; Conforti, F.; Statti, G.A.; Menabeni, R.; Bettini, R.; Menichini, F., Chemical composition and bioactivity of Citrus medica L. cv. Diamante essential oil obtained by hydrodistillation, cold-pressing and supercritical carbon dioxide extraction, Nat. Prod. Res., 2011, 25, 8, 789-799, https://doi.org/10.1080/14786410902900085 . [all data]

Miyazawa, Marumoto, et al., 2011
Miyazawa, M.; Marumoto, S.; Kobayashi, T.; Yoshida, S.; Utsumi, Y., Determination of characteristic components in essential oils from Wisteria braphybotrys using gas chromatography - olfactometry incremental dilution technique, Rec. Nat. Prod., 2011, 5, 3, 221-227. [all data]

Piyachaiseth, Jirapakkul, et al., 2011
Piyachaiseth, T.; Jirapakkul, W.; Chaiseri, S., Aroma compounds of flash-fried rice, Kasetsart J. (Nat. Sci.), 2011, 45, 717-729. [all data]

Vazques, Aimar, et al., 2011
Vazques, A.M.; Aimar, M.L.; Demmel, G.I.; Criado, S.G.; Ruiz, G.M.; Cantero, J.J.; Rossi, L.I.; Velasco, M.I., Determination of volatile organic compounds of Tagetes argentina Cabrera (asteraceae) using HS-SPME analysis, Boletin Latinoamericano y del Caribe Plantas Medicinales y Aromaticas, 2011, 10, 5, 463-469. [all data]

Vazquez, Demmel, et al., 2011
Vazquez, A.M.; Demmel, G.I.; Criado, S.G.; Aimar, M.L.; Cantero, J.; Rossi, L.I.; Velasco, M.I., Phytochemistry of TAgetes minuta L. (Asteraceae) from Cordoba, Argentina: comparative study between essential oil and HS-SPME analyses, Boletin Latinoamericano y del Caribe Plantas Medicinales y Aromaticas, 2011, 10, 4, 351-362. [all data]

Chalchat, Figueredo, et al., 2010
Chalchat, J.-C.; Figueredo, G.; Ozcan, M.M.; Unver, A., Effect of hydrodistillation and microwave distillation extraction methods on chemical composition of essential oil of pickling herb and myrtle plants, South Western J. of Agriculture, 2010, 1, 2, 133-141. [all data]

Dib, Bendahou, et al., 2010
Dib, M.A.; Bendahou, M.; Bendiabdellah, A.; Djabou, N.; Allali, H.; Tabti, B.; Paolini, J.; Costa, J., Partial chemical composition and antimicrobial activity of Daucus crinitus Desf. extracts, Grasas y Aceites, 2010, 61, 3, 271-278, https://doi.org/10.3989/gya.122609 . [all data]

Dib, Djabou, et al., 2010
Dib, M.ElA.; Djabou, N.; Desjobert, L.-M.; Allali, H.; Tabti, B.; Muselli, A.; Costa, J., Characterization of volatile compounds of Daucus crinitus Desf. headspace solid phase microextraction as alternative technique to hydrodistillation, Chem, Centr. J., 2010, 4, 16, 1-15. [all data]

Ho, Wang, et al., 2010
Ho, C.-L.; Wang, E.I.-C.; Yu, H.-T.; Yu, H.-M.; Su, Y.-C., Composition amd antioxidant activities of essential oils of different tissues from Cryptomeria japonica D. Don, Quarterly J. Chin. Forestry, 2010, 32, 1, 63-76. [all data]

Hu, Liang, et al., 2010
Hu, C.-D.; Liang, Y.-Z.; Guo, F.-Q.; Li, X.-R.; Wang, W.-P., Determination of essential oil composition from Osmanthus fragrans tea by GC-MS combined with a chemometric resolution method, Molecules, 2010, 15, 5, 3683-3693, https://doi.org/10.3390/molecules15053683 . [all data]

Mesa-Arango, Betancur-Galvis, et al., 2010
Mesa-Arango, A.C.; Betancur-Galvis, L.; Montiel, J.; Bueno, J.G.; Baena, A.; Duran, D.C.; Martinez, J.R.; Stashenko, E.E., Antifungal activity and chemical composition of the essential oils of Lippia alba (Miller) N.E. Brown grown in different regions of Colombia, J. Essential Oil Res., 2010, 22, 6, 568-574, https://doi.org/10.1080/10412905.2010.9700402 . [all data]

Mishra, Chaudhary, et al., 2010
Mishra, R.K.; Chaudhary, S.; Pandey, R.; Gupta, S.; Mallavarapu, G.R.; Kumar, S., Analysis of linalool content in the inflorescence (flower) essential oil and leaf oil of Lippia alba cultivar Kavach, J. Essen. Oil Res., 2010, 22, 1, 3-7, https://doi.org/10.1080/10412905.2010.9700253 . [all data]

Miyazawa, Kawauchi, et al., 2010
Miyazawa, M.; Kawauchi, Y.; Utsumi, Y.; Takahashi, T., Character impact odorants of wild edible plant - Cacalia hastata L. var. orientalis - used in Japanese traditional food, J. Oleo Sci., 2010, 59, 10, 527-533, https://doi.org/10.5650/jos.59.527 . [all data]

Ogunwande, Flamini, et al., 2010
Ogunwande, I.A.; Flamini, G.; Cioni, P.L.; Omikorede, O.; Azeez, R.A.; Ayodele, A.A.; Kamil, Y.O., Aromatic plants growing in Nigeria: essential oil constituents of Cassia alata (Linn.) Roxb. and Helianthus annuus L., Rec. Nat. Prod., 2010, 4, 4, 211-217. [all data]

Pripdeevech, Chumpolsri, et al., 2010
Pripdeevech, P.; Chumpolsri, W.; Suttiarporn, P.; Wongpornchai, S., The chemical composition and antioxidant activities of Basil from Thailand using retention indices and comprehensive two-dimensional gas chromatography, J. Seb. Chem. Soc., 2010, 75, 11, 1503-1513, https://doi.org/10.2298/JSC100203125P . [all data]

Radulovic, Dordevic, et al., 2010
Radulovic, N.S.; Dordevic, N.D.; Palic, R.M., Volatiles of Pleurospermum austriacum (L.) Hoffm. (Apiaceae), J. Serbian Chem. Soc., 2010, 75, 12, 1-11, https://doi.org/10.2298/JSC100323127R . [all data]

Scandinaro, Tranchida, et al., 2010
Scandinaro, M.; Tranchida, P.Q.; Costa, R.; Dugo, P.; Mondello, L., Rapid Quality Control of Flavours and Fragrances using Fast GC-MS and Multi-MS Library Search Procedures, LCGC Europe, 2010, 23, 9, 456-464. [all data]

Takeoka, Hobbs, et al., 2010
Takeoka, G.R.; Hobbs, C.; Byeoung-Soo, P., Volatile constituents of the aerial parts of Salvia apiana Jepson, J. Essential Oil. Res., 2010, 22, 3, 241-244, https://doi.org/10.1080/10412905.2010.9700314 . [all data]

Usman, Zubair, et al., 2010
Usman, L.A.; Zubair, M.F.; Adabayo, S.A.; Oladosu, I.A.; Muhammad, N.O.; Akolade, J.O., Chemical composition of leaf and fruit essential oils of Hoslundia opposita Vahl grown in Nigeria, Americal-Eurasian J. Agric. Environ. Sci., 2010, 8, 1, 40-43. [all data]

Vahirua-Lechat, Mitermite, et al., 2010
Vahirua-Lechat, I.; Mitermite, Y.; Menut, C., Aromatic plants of French Polynesia. IV. Composition and chemical variations of the essential oils of leaves of Etlingera cevuga (seeman) R.E. Smith, J. Essen. Oil Res., 2010, 22, 5, 407-409, https://doi.org/10.1080/10412905.2010.9700357 . [all data]

Alim, Goze, et al., 2009
Alim, A.; Goze, I.; Cetin, A.; Atas, A.; Vural, N.; Donmez, E., Antimicrobial activity of the essential oil of Cyclotrichimun niveum (Boiss.) Manden. Et Scheng, African J. Microbiol. Res., 2009, 3, 8, 422-425. [all data]

Benites, Moiteiro, et al., 2009
Benites, J.; Moiteiro, C.; Miguel, G.; Rojo, L.; Lopez, J.; Venancio, F.; Ramalho, L.; Feio, S.; Dandlen, S.; Casanova, H.; Torres, I., Composition and biological activity of the essential oil of Peruvial Lantana camara, J. Chilean Chem. Soc., 2009, 54, 4, 379-384, https://doi.org/10.4067/S0717-97072009000400012 . [all data]

Dayisoylu and Alma, 2009
Dayisoylu, K.S.; Alma, M.H., Chemical analysis of essential oils from cone's rosin of Cilician fir (Abies cilicica subsp. cilicica), Afr. J. Biotechnol., 2009, 8, 15, 3502-3505. [all data]

Gardini, Beletti, et al., 2009
Gardini, F.; Beletti, N.; Ndagikimana, M.; Guerzoni, M.E.; Tchoumbougnang, F.; Zollo, P.H.A.; Micci, C.; Lanciotti, R.; Kamdem, S.L.S., Composition of four essential oils obtained from plants from Cameroon, and their bactericidal and bacteriostatic activity against Listeria Monocytogenes, Salmonella enteritidis and Staphyllococcus aureus, African J. Microbiol. Res., 2009, 3, 5, 264-271. [all data]

Gilani, Shah, et al., 2009
Gilani, A.H.; Shah, A.J.; Zubair, A.; Khalid, S.; Kiani, J.; Ahmed, A.; Rasheed, M.; Ahmad, V.U., Chemical composition and mechanisms underlying the spasmolytic and bronchodilatory properties of the essential oil of Nepeta cataria L., J. Ethnopharmacology, 2009, 121, 3, 405-411, https://doi.org/10.1016/j.jep.2008.11.004 . [all data]

Ho, Wang, et al., 2009
Ho, C.-L.; Wang, E.I.-C.; Su, Y.-C., Essential oil compositions and bioactivities of the various parts of Cinnamomum camphora Sieb. var. linallolifera Fujuta, Journal title only in Chinese, 2009, 31, 2, 77-96. [all data]

Kazemi and Akhavani, 2009
Kazemi, M.; Akhavani, S., Constituents of Artemisia tournefortiana Rchb. essential oil from Iran, J. Appl. Chem. Res., 2009, 3, 10, 1-5. [all data]

Koba, Catherine, et al., 2009
Koba, K.; Catherine, G.; Raynaud, C.; Chaumont, J.-P.; Sanda, K.; Laurence, N., Chemical composition and cytotoxic activity of Chenopodium ambrosioides L. essential oil from Togo, Bangladesh J. Sci. Ind. Res., 2009, 44, 4, 435-440. [all data]

Males, Plazibat, et al., 2009
Males, Z.; Plazibat, M.; Bucar, F., Essential oil of Portanschlagiella ramosissima from Croatia, a rich source of myristicin, Croat. Chem. Acta, 2009, 82, 4, 725-728. [all data]

Maridass, 2009
Maridass, M., Inter-generic relationships of Ocimum and Origanum based on GC-MS volatile oils data using software NTSPSpc version 2.0, Ethnobotanical Leaflets, 2009, 13, 83-88. [all data]

Museli, Pau, et al., 2009
Museli, A.; Pau, M.; Desjobert, J.-M.; Foddai, M.; Usai, M.; Costa, J., Volatile constituents of Achllea ligustica All. by HS-SPME/GC/GC-MS. Comparison with essential oils obtained by hydrodistillation from Corsica and Sardinia, Chromatographia, 2009, 69, 5/6, 575-585, https://doi.org/10.1365/s10337-008-0939-1 . [all data]

Porto, Decorti, et al., 2009
Porto, C.Da.; Decorti, D.; Kikic, I., Flavour compounds of Lavandula angustifolia L. to use in food manufacturing: comparison of three different extraction methods, Food Chem., 2009, 112, 4, 1072-1078, https://doi.org/10.1016/j.foodchem.2008.07.015 . [all data]

Retta, Gattuso, et al., 2009
Retta, D.; Gattuso, M.; Gattuso, S.; Lira, P. Di Leo; van Baren, C.; Ferraro, G.; Bandoni A., Essential oil composition of Achyrocline flaccida (Weinm.) DC. (Asteraceae) from different locations of Argentina, Biochem. Systematics Ecol., 2009, 36, 12, 877-881, https://doi.org/10.1016/j.bse.2008.11.001 . [all data]

Shafaghat and Sadeghi, 2009
Shafaghat, A.; Sadeghi, H., Composition and antibacterial activity of essentia; oils from leaf, stem and root of Chrysanthemum parthenium (L.) Bernh. from Iran, Electronic J. of Environ., Agriculture and Food Chem. (EJEAFChe), 2009, 8, 9, 766-771. [all data]

Shimizu, Imayoshi, et al., 2009
Shimizu, Y.; Imayoshi, Y.; Kato, M.; Maeda, K.; Iwabuchi, H.; Shimomura, K., Volatiles from leaves of field-grown plants and shoot cultures of Gynura bicolor DC, Flavour Fragr. J., 2009, 24, 5, 251-258, https://doi.org/10.1002/ffj.1938 . [all data]

Su, Wang, et al., 2009
Su, Y.; Wang, C.; Yinlong, G., Analysis of volatile compounds from Mentha hapioealyx Briq. by GC-MS based on accurate mass measurements and retention indices, Acta Chem. Sinica, 2009, 67, 6, 546-554. [all data]

Wannes, Mhamdi, et al., 2009
Wannes, W.A.; Mhamdi, B.; Marzouk, B., GC comparative analysis of least essential oils from two Myrtle varieties at different phenological stages, Chromatographia, 2009, 69, 1/2, 145-150, https://doi.org/10.1365/s10337-008-0818-9 . [all data]

Zhao, Zeng, et al., 2009
Zhao, C.; Zeng, Y.; Wan, M.; Li, R.; Liang, Y.; Li, C.; Zeng, Z.; Chau, F.-T., Comparative analysis of essential oils from eight herbal medicines with pungent flavor and cool nature by GC-MS and chemometric resolution methods, J. Sep. Sci., 2009, 32, 4, 660-670, https://doi.org/10.1002/jssc.200800484 . [all data]

Aicha, Ines, et al., 2008
Aicha, N.; Ines, S.; Mohamed, B.S.; Ines, B.; Soumaya, K.; Kamel, G.; Mohamed, N.; Imed, C.; Mohamed, H.; Leila, C.-G., Chemical composition, mutagenic and antimutagenic activities of essential oils from (Tunisian) Artemisia campestris and Artemisia herba-alba, J. Ess. Oil Res., 2008, 20, 5, 471-477. [all data]

Baziou, Couladis, et al., 2008
Baziou, P.; Couladis, M.; Petrakis, P.V.; Verykokidou, E.; Harvala, C., Composition and antioxidant activity of the essential oil of Hypericum perfoliatum from Greece, 2008, retrieved from http://www.amapseec.org/cmapseec.1/Papers/papp065.htm. [all data]

Flamini, Tebano, et al., 2008
Flamini, G.; Tebano, M.; Cioni, P.L., Composition of the essential oils from leafy parts of the shoots, flowers and fruits of Eryngium amethystinum from Amiata Mount (Tuscany, Italy), Food Chem., 2008, 107, 2, 671-674, https://doi.org/10.1016/j.foodchem.2007.08.064 . [all data]

Forero, Quijano, et al., 2008
Forero, M.D.; Quijano, C.E.; Pino, J.A., Volatile compounds of Chile pepper (Capsicum annuum L. var. glabriusculum) at two ripening stages, Flavour Fragr. J., 2008, 24, 1, 25-30, https://doi.org/10.1002/ffj.1913 . [all data]

Lo Presti, Sciarrone, et al., 2008
Lo Presti, M.; Sciarrone, D.; Crupi, M.C.; Costa, R.; Ragusa, S.; Dugo, G.; Mondello, L., Evaliation of the volatile and chiral composition in Pistacia lentiscus L. essential oil, Flavour Fragr. J., 2008, 23, 4, 249-257, https://doi.org/10.1002/ffj.1878 . [all data]

Mierendorff, Stahl-Biskup, et al., 2008
Mierendorff, H.-G.; Stahl-Biskup, E.; Posthumus, M.A.; van Beek, T.A., Composition of commercial Cape chamomile oil (Eriocephalus punctuatus / Eriocephalus tenuifolius), 2008, retrieved from http://www.chemische-analysen-hamburg.de/Publikationen?CapeChamomileOil/. [all data]

Noudogbessi, Yedomonhan, et al., 2008
Noudogbessi, J.-P.; Yedomonhan, P.; Sohounhloue, D.C.K.; Chalchat, J.-C.; Figueredo, G., Chemical composition of essential oil of syzygium guineense (Willd.) DC. var. guineense (Myrtaceae) from Benin, Rec. Nat. Prod., 2008, 33-38. [all data]

Sahraoui, Vian, et al., 2008
Sahraoui, N.; Vian, M.A.; Bornard, I.; Boutekedjiret, C.; Chemat, F., Improved microwave steam distillation apparatus for isolation of essential oils. Comparison with conventional steam distillation, J. Chromatogr. A., 2008, 1210, 2, 229-233, https://doi.org/10.1016/j.chroma.2008.09.078 . [all data]

Shellie, 2008
Shellie, R.A., Comprehensive 2D GC-QPMS with differential flow modulation, LV-GC, 2008, 11, 7-18. [all data]

Skalicka-Wozniak, Los, et al., 2008
Skalicka-Wozniak, K.; Los, R.; Glowniak, K.; Malm, A., Variation of the volatile content of the fruits of Peucedanum alsaticum L., Acta Chromatographica, 2008, 20, 1, 119-133, https://doi.org/10.1556/AChrom.20.2008.1.10 . [all data]

Yassa and Akhani, 2008
Yassa, N.; Akhani, H., The essential oils composition in two species of the genus Eriocycla Lindl. (Apiaceae) from Iran, 2008, retrieved from http://biology.ut.ac.ir/members/akhani/PdfReprintNumber/27.pdf. [all data]

Adams, Beauchamp, et al., 2007
Adams, R.P.; Beauchamp, P.S.; Dev, V.; Dutz, S.M., New Natural Products Isolated from One-Seeded Juniperus of the Southwestern United States: Isolation and Occurence of 2-Ethenyl-3-methyl Phanol and Its Derivatives, J. Essent. Oil Res., 2007, 19, 2, 146-152, https://doi.org/10.1080/10412905.2007.9699247 . [all data]

Alma, Ertas, et al., 2007
Alma, M.H.; Ertas, M.; Nitz, S.; Kollmannsberger, H., Chemical composition and content of essential oil from the bud of cultivated Turkish clove (Syzygium aromaticum L.), BioResources, 2007, 2, 2, 265-269. [all data]

Amiri, 2007
Amiri, H., Quantative and qualative changes of essential oil of Salvia bracteata BAnk et Sol. in different growth stages, DARU, 2007, 15, 2, 79-82. [all data]

Basta, Pavlovic, et al., 2007
Basta, A.; Pavlovic, M.; Couladis, M.; Tzakou, O., Essential oil composition of the flowerheads of Chrysanthemum coronarium L. from Greece, Flavour Fragr. J., 2007, 22, 3, 197-200, https://doi.org/10.1002/ffj.1781 . [all data]

Bos, Woerdenbag, et al., 2007
Bos, R.; Woerdenbag, H.J.; Kayser, O.; Quax, W.J.; Ruslan, K.; Elfami, Essential oil constituents of Piper cubeba L. fils. from Indonesia, J. Essent. Oil Res., 2007, 19, 1, 14-17, https://doi.org/10.1080/10412905.2007.9699217 . [all data]

Cheraif, Ben Jannet, et al., 2007
Cheraif, I.; Ben Jannet, H.; Hammami, M.; Khouja, M.L.; Mighri, Z., Chemical composition and antimicrobial activity of essential oils of Cupressus arizonica Greene, Biochem. Syst. Ecol., 2007, 35, 12, 813-820, https://doi.org/10.1016/j.bse.2007.05.009 . [all data]

Da Silva J.K.R., Sousa P.J.C., et al., 2007
Da Silva J.K.R.; Sousa P.J.C.; Andrade E.H.A.; Maia JGS, Antioxidant capacity and cytotoxicity of essential oil and methanol extract of Aniba canellia (HBK) Mez, J. Agric. Food Chem., 2007, 55, 23, 9422-9426, https://doi.org/10.1021/jf071928e . [all data]

Elfami, Bos, et al., 2007
Elfami; Bos, R.; Ruslan, K.; Woerdenbag, H.J.; Kayser, P.; Quax, W.J., Essential Oil Constituents of Piper cubeba from Indonesia, 2007, 53-60. [all data]

Farsam, Amanlou, et al., 2007
Farsam, H.; Amanlou, M.; Taghi-Cheetsaz, N.; Amin, G.R.; Saledi-Sormaghi, M.H., Essential Oil of Chimonanthus fragrans flowers Population of Tehran, DARU, 2007, 15, 3, 129-131. [all data]

Füssel, Dötterl, et al., 2007
Füssel, U.; Dötterl, S.; Jürgens, A.; Aas, G., Inter- and intraspecific variation in floral scent in the genus Salix and its implication for pollination, J. Chem. Ecol., 2007, 33, 4, 749-765, https://doi.org/10.1007/s10886-007-9257-6 . [all data]

Ghasempour, Shirinpour, et al., 2007
Ghasempour, H.R.; Shirinpour, E.; Heidari, H., The constituents of essential oils of Ferulago angulata (Schlecht.) Boiss at two different habitats, Nevakoh and Shahoo, Agross mountain, Western Iran, Iranian J. Sci. Technol., 2007, 31, A3, 309-312. [all data]

Gudaityte and Venskutonis R.P., 2007
Gudaityte, O.; Venskutonis R.P., Chemotypes of Achillea millefolium transferred from 14 different locations in Lithuania to the controlled environment, Biochem. Syst. Ecol., 2007, 35, 9, 582-592, https://doi.org/10.1016/j.bse.2007.03.016 . [all data]

Kiran, Devi, et al., 2007
Kiran, S.R.; Devi, P.S.; Reddy, K.J., Bioactivity of essential oils and sesquiterpenes of Chloroxylon swietenia DC against Helicoverpa armigera, Current Science, 2007, 93, 4, 544-548. [all data]

Limberger, Scopel, et al., 2007
Limberger, R.P.; Scopel, M.; Sobral, M.; Henriques, A.T., Comparative analysis of volatiles from Drimys brasiliensis Miers and D. angustifolia Miers (Winteraceae) from Southern Brazil, Biochem. Syst. Ecol., 2007, 35, 3, 130-137, https://doi.org/10.1016/j.bse.2006.09.007 . [all data]

Machado, Bastos, et al., 2007
Machado, C.C.B.; Bastos, D.H.M.; Janzantti, N.S.; Facanali, R.; Marques, M.M.; Franco, M.R.B., Determinação do perfil de compostos voláteis e avaliação do sabor e aroma de bebidas produzidas a partir da erva-mate (Ilex paraguariensis), Quim. Nova, 2007, 30, 3, 513-518, https://doi.org/10.1590/S0100-40422007000300002 . [all data]

Matasyoh, Matasyoh, et al., 2007
Matasyoh, L.G.; Matasyoh, J.C.; Wachira, F.N.; Kinyua, M.G.; Muigai, A.W.T.; Mukiama, T.K., Chemical composition and antimicrobial activity of the essential oil of Ocimum gratissimum L. growing in Eastern Kenya, Afr. J. Biotechnol., 2007, 6, 760-765. [all data]

Mohottalage, Tabacchi, et al., 2007
Mohottalage, S.; Tabacchi, R.; Guerin, P.M., Components from Sri Lankan Piper betle L. leaf oil and their analogues showing toxicity against the housefly, Musca domestica, Flavour Fragr. J., 2007, 22, 2, 130-138, https://doi.org/10.1002/ffj.1770 . [all data]

Monser-Esfahani, Karamkhani, et al., 2007
Monser-Esfahani, H.R.; Karamkhani, F.; Nickavar, B.; Abdi, K.; Faramarzi, M.A., The Volatile Constituents of Dracocephalum kotschyi Oils, Chem. Nat. Comp., 2007, 43, 1, 40-43, https://doi.org/10.1007/s10600-007-0027-z . [all data]

Moreno, Lima, et al., 2007
Moreno, P.R.H.; Lima, M.E.L.; Sobral, M.; Young, M.C.M.; Cordeiro, I.; Apel, M.A.A.; Limberger, R.P.; Henriques, A.T., Essential oil composition of fruit colour varieties of Eugenia brasiliensis Lam., Sci. Agr.; (Piracicaba Praz.), 2007, 64, 4, 428-432. [all data]

Oliveira, Leitão, et al., 2007
Oliveira, D.R.; Leitão, G.G.; Bizzo, H.R.; Lopes, D.; Alviano, D.S.; Alviano, C.S.; Leitão, S.G., Chemical and antimicrobial analyses of essential oil of Lippia origanoides H.B.K, Food Chem., 2007, 101, 1, 236-240, https://doi.org/10.1016/j.foodchem.2006.01.022 . [all data]

Pala-Paul, Brophy, et al., 2007
Pala-Paul, J.; Brophy, J.J.; Perez-Alonso, M.J.; Usano, J.; Soria, S.C., Essential oil composition of the different parts of Eryngium corniculatum Lam. (Apiaceae) from Spain, J. Chromatogr. A, 2007, 1175, 2, 289-293, https://doi.org/10.1016/j.chroma.2007.10.061 . [all data]

Rali, Wossa, et al., 2007
Rali, T.; Wossa, S.W.; Leach, D.N.; Waterman, P.G., Volatile chemical constituents of Piper aduncum L and Piper gibbilimbum C. DC (Piperaceae) from Papua New Guinea, Molecules, 2007, 12, 3, 389-394, https://doi.org/10.3390/12030389 . [all data]

Reza, Ebrahim, et al., 2007
Reza, G.H.; Ebrahim, S.; Hossein, H., Analysis by gas chromatography - mass spectrometry of essential oil from seeds and aerial parts of Ferulago angulata (Schlecht.) Boiss gatheres in Nevakoh and Shahoo, Zagross mountain, west of Iran, Pakistan J. Biol. Sci., 2007, 10, 5, 814-817, https://doi.org/10.3923/pjbs.2007.814.817 . [all data]

Rojas, Velasco, et al., 2007
Rojas, J.; Velasco, J.; Rojas, L.B.; Carmona, J.; Morales, A., Chemical composition and antimicrobial activity of the essential oil of Baacharis latifolia Pers. and B. prunifolia H.B.K. (Asteraceae), Natural Product Communications, 2007, 2, 12, 1245-1248. [all data]

Sefidkon, Abbasi, et al., 2007
Sefidkon, F.; Abbasi, K.; Jamzad, Z.; Ahmadi, S., The effect of distillation methods and stage of plant growth on the essential oil content and composition of Satureja rechingeri Jamzad, Food Chem., 2007, 100, 3, 1054-1058, https://doi.org/10.1016/j.foodchem.2005.11.016 . [all data]

Sylvestre, Longtin, et al., 2007
Sylvestre, M.; Longtin, A.P.A.; Legault, J., Volatile leaf condtituents and anticancer activity of Bursera simaruba (L.) Sarg. essential oil, Natural Product Communications, 2007, 2, 12, 1273-1276. [all data]

Sylvestre, Pichette, et al., 2007
Sylvestre, M.; Pichette, A.; Longtin, A.; Martin, M.-A.C.; Bercion, S.R.; Legault, J., Chemical composition of leaf essential oil of Hedyosmum arborescens and evaluation of its anticancer activity, Natural Product Communications, 2007, 2, 12, 1269-1272. [all data]

Tava, Pecetti, et al., 2007
Tava, A.; Pecetti, L.; Ricci, M.; Pagnotta, M.A.; Russi, L., Volatile compounds from leaves and flowers of Bituminaria bituminosa (L.) Stirt. (Fabaceae) from Italy, Flavour Fragr. J., 2007, 22, 5, 363-370, https://doi.org/10.1002/ffj.1806 . [all data]

Tsokou, Georgopoulos, et al., 2007
Tsokou, A.; Georgopoulos, K.; Melliou, E.; Magiatis, P.; Tsitsa, E., Composition and enantiomeric analusis of the essential oil of the fruits and the leaves of Pistacia vera from Greece, Molecules, 2007, 12, 6, 1233-1239, https://doi.org/10.3390/12061233 . [all data]

Tzakou, Bazos, et al., 2007
Tzakou, O.; Bazos, I.; Yannitsaros, A., Volatile metabolites of Pistacia atlantica Desf. from Greece, Flavour Fragr. J., 2007, 22, 5, 358-362, https://doi.org/10.1002/ffj.1805 . [all data]

Vagionas, Graikou, et al., 2007
Vagionas, K.; Graikou, K.; Ngassapa, O.; Runyoro, D.; Chinou, I., Composition and antimicrobial activity of the essential oils of three Satureja species growing in Tansania, Food Chem., 2007, 103, 2, 319-324, https://doi.org/10.1016/j.foodchem.2006.07.051 . [all data]

Vichi, Riu-Aumatell, et al., 2007
Vichi, S.; Riu-Aumatell, M.; Mora-Pons, M.; Guadayol, J.M.; Buxaderas, S.; López-Tamames, E., Analytical, Nutritional and Clinical Methods. HS-SPME coupled to GC/MS for quality control of Juniperus communis L. berries used for gin aromatization, Food Chem., 2007, 105, 4, 1748-1754, https://doi.org/10.1016/j.foodchem.2007.03.026 . [all data]

Yassa and Akhani, 2007
Yassa, N.; Akhani, H., The essential oils composition in two species of the genus Eriocycla Lindl. (Apiaceae) from Iran, 2007, retrieved from http://biology.ut.ac.ir/members/akhani/PdfReprintNumber/27.pdf. [all data]

Abdelwahed, Hayder, et al., 2006
Abdelwahed, A.; Hayder, N.; Kilani, S.; Mahmoud, A.; Chibani, J.; Hammami, M.; Chekir-Ghedira, L.; Ghedira, K., Chemical composition and antimicrobial activity of essential oils from Tunisian Pituranthos tortuosus (Coss.) Maire, Flavour Fragr. J., 2006, 21, 1, 129-133, https://doi.org/10.1002/ffj.1542 . [all data]

Ayoub, Al-Azizi, et al., 2006
Ayoub, N.; Al-Azizi, M.; König, W.; Kubeczka, K.-H., Essential oils and a novel polyacetylene from Eryngium yuccifolium Michaux. (Apiaceae), Flavour Fragr. J., 2006, 21, 6, 864-868, https://doi.org/10.1002/ffj.1631 . [all data]

Bertrand, Comte, et al., 2006
Bertrand, C.; Comte, G.; Piola, F., Solid-phase microextraction of volatile compounds from flowers of two Brunfelsia species, Biochem. Syst. Ecol., 2006, 34, 5, 371-375, https://doi.org/10.1016/j.bse.2005.12.005 . [all data]

Berlioz, Cordella, et al., 2006
Berlioz, B.; Cordella, C.; Cavalli, J.-F.; Lizzani-Cuvelier, L.; Loiseau, A.-M.; Fernandez, X., Comparison of the amounts of volatile compounds in French protected designation of origin virgin olive oils, J. Agric. Food Chem., 2006, 54, 26, 10092-10101, https://doi.org/10.1021/jf061796+ . [all data]

Boti, Yao, et al., 2006
Boti, J.B.; Yao, P.A.; Koukoua, G.; N'Guessan, T.Y.; Casanova, J., Components and chemical variability of Isolona campanulata Engler Diels leaf oil, Flavour Fragr. J., 2006, 21, 1, 166-170, https://doi.org/10.1002/ffj.1555 . [all data]

Castel, Fernandez, et al., 2006
Castel, C.; Fernandez, X.; Lizzani-Cuvelier, L.; Perichet, C.; Lavoine, S., Characterization of the Chemical Composition of a Byproduct from Siam Benzoin Gum, J. Agric. Food Chem., 2006, 54, 23, 8848-8854, https://doi.org/10.1021/jf061193y . [all data]

Cavaleiro, Pinto, et al., 2006
Cavaleiro, C.; Pinto, E.; Gonsales, M.J.; Salguero, L., Antifungal activity of Juniperus essential oils agains dermatophyte, Asrgillus and Candida strains, J. Appl. Microbiol., 2006, 100, 6, 1333-1338, https://doi.org/10.1111/j.1365-2672.2006.02862.x . [all data]

Ceva-Antunes, Bizzo, et al., 2006
Ceva-Antunes, P.M.N.; Bizzo, H.R.; Silva, A.S.; Carvalho, C.P.S.; Antunes, O.A.C., Analysis of volatile composition of siriguela (Spondias purpurea L.) by solid phase microextraction (SPME), LWT, 2006, 39, 4, 437-443, https://doi.org/10.1016/j.lwt.2005.02.007 . [all data]

Coronel, Cerda-Garcia-Rojas, et al., 2006
Coronel, A. del.C.; Cerda-Garcia-Rojas, C.M.; Joseph-Nathan, P.; Catalán, C.A.N., Chemical composition, seasonal variation and a new sesquiterpene alcohol from the essential oil of Lippia integrifolia, Flavour Fragr. J., 2006, 21, 5, 839-847, https://doi.org/10.1002/ffj.1736 . [all data]

Ebrahim Sajjadi and Mehregan, 2006
Ebrahim Sajjadi, S.; Mehregan, I., Volatile constituents of flowers and leaves of Anthemis hyalina, Chem. Nat. Compd. (Engl. Transl.), 2006, 42, 5, 531-533, https://doi.org/10.1007/s10600-006-0207-2 . [all data]

Elfami, Komar, et al., 2006
Elfami, R.B.; Komar, R.; Woerdenbag, H.J.; Kayser, P.; Quax, W.J., Essential oil constituents of Piper cubeba from Indonesia, 2006, retrieved from http://dissertations.ub.rug.nl/FILES/facultiew/science/2006/elfahmi/05c5.pdf. [all data]

Fanciullino, Tomi, et al., 2006
Fanciullino, A.-L.; Tomi, F.; Luro, F.; Desjobert, J.M.; Casanova, J., Chemical variability of peel and leaf oils of mandarins, Flavour Fragr. J., 2006, 21, 2, 359-367, https://doi.org/10.1002/ffj.1658 . [all data]

Fernandez, Pintaric, et al., 2006
Fernandez, X.; Pintaric, C.; Lizzani-Cuvelier, L.; Loiseau, A.-M.; Morello, A.; Pellerin, P., Chemical composition of absolute and supercritical carbon dioxide extract of Aframomum melegueta, Flavour Fragr. J., 2006, 21, 1, 162-165, https://doi.org/10.1002/ffj.1554 . [all data]

Figuérédo, Cabassu, et al., 2006
Figuérédo, G.; Cabassu, P.; Chalchat, J.-C.; Pasquier, B., Studies of Mediterranean oregano populations. VIII. Chemical composition of essential oils of oreganos of various origins, Flavour Fragr. J., 2006, 21, 1, 134-139, https://doi.org/10.1002/ffj.1543 . [all data]

Havlik, Kokoska, et al., 2006
Havlik, J.; Kokoska, L.; Vasickova, S.; Valterova, I., Chemical composition of essential oil from the seeds of Nigella arvensis L. and assessment of its actimicrobial activity, Flavour Fragr. J., 2006, 21, 4, 713-717, https://doi.org/10.1002/ffj.1713 . [all data]

Ibañez and Usubillaga, 2006
Ibañez, J.; Usubillaga, A., The essential oil of Espeletia schultzii of different altitudinal populations, Flavour Fragr. J., 2006, 21, 2, 286-289, https://doi.org/10.1002/ffj.1586 . [all data]

Ibanez and Usubillaga, 2006
Ibanez, J.; Usubillaga, A., Analysis of the essential oil of two different altitudinal populations of Coespeletia moritziana (Sch. Bip.ex Wedd) Cuatrec, Flavour Fragr. J., 2006, 21, 5, 760-763, https://doi.org/10.1002/ffj.1655 . [all data]

Javidnia, Miri, et al., 2006
Javidnia, K.; Miri, R.; Kamalinejad, M.; Mehdipour, A.R., Composition of the essential oil of Diplotaenia cachrydifolia Boiss. from Iran, J. Ess. Oil Res., 2006, 18, 1, 86-87, https://doi.org/10.1080/10412905.2006.9699393 . [all data]

Kasali, Ekundayo, et al., 2006
Kasali, A.A.; Ekundayo, O.; Paul, C.; Konig, W.A.; Eshilokun, A.O.; Ige, B., 1,2 : 3,4-Diepoxy-p-menthane and 1,4-epoxy-p-menth-2-ene: Rare monoterpenoids from the essential oil of Chenopodium ambrosioides L. var ambrosioides leaves, J. Essent. Oil Res., 2006, 18, 1, 13-15, https://doi.org/10.1080/10412905.2006.9699372 . [all data]

Kiran, Bhavani, et al., 2006
Kiran, S.R.; Bhavani, K.; Devi, P.S.; Rao, B.R.R.; Reddy, K.J., Composition and alrvicidal activity of leaves and stem essential oils of Chloroxylon swietenia DC against Aedes aegypti and Anopheles stephensi, Biores. Technol., 2006, 97, 18, 2481-2484, https://doi.org/10.1016/j.biortech.2005.10.003 . [all data]

Kitchlu, Bakshi, et al., 2006
Kitchlu, S.; Bakshi, S.K.; Kaul, M.K.; Bhan, M.K.; Thapa, R.K.; Agarwal, S.G., Tanacetum gracile Hook. f T. A new source of lavandulol from Ladakh Himalaya (India), Flavour Fragr. J., 2006, 21, 4, 690-692, https://doi.org/10.1002/ffj.1674 . [all data]

Lis and Milczarek, 2006
Lis, A.; Milczarek, J., Chemical composition of the essential oils from fruits, leaves and flowers of Phellodendron sachalinense (Fr. Schmidt) Sarg., Flavour Fragr. J., 2006, 21, 4, 683-686, https://doi.org/10.1002/ffj.1662 . [all data]

Martin, Joseph, et al., 2006
Martin, M.A.C.K.; Joseph, H.; Bercion, S.; Menut, C., Chemical composition of essential oils from aerial parts of Aframomum exscapum (Sims) Hepper collected in Guadeloupe, French West Indies, Flavour Fragr. J., 2006, 21, 6, 902-905, https://doi.org/10.1002/ffj.1741 . [all data]

Mirza, Navaei, et al., 2006
Mirza, M.; Navaei, M.N.; Dini, M., Volatile constituents of essential oils isolated from flowers and leaves of Eupatorium cannabinum L. from Iran, Iranian J. Pharmaceutical Res., 2006, 2, 149-152. [all data]

Morteza-Semnani K., Saeedi M., et al., 2006
Morteza-Semnani K.; Saeedi M.; Changizi S., The essential oil composition of Hypericum scabrum L. from Iran, Flavour Fragr. J., 2006, 21, 3, 513-515, https://doi.org/10.1002/ffj.1614 . [all data]

Najafpour Navaei, Mirza, et al., 2006
Najafpour Navaei, M.; Mirza, M.; Dini, M., Chemical composition of the essential oils of Rubia tinctorum L. aerial parts from Iran, Flavour Fragr. J., 2006, 21, 3, 519-520, https://doi.org/10.1002/ffj.1667 . [all data]

Nickavar B., Kamalinejad M., et al., 2006
Nickavar B.; Kamalinejad M.; Mohandesi S., Comparison of the components of the essential oils from leaves and fruits of Grammosciadium platycarpum, Chem. Nat. Compd. (Engl. Transl.), 2006, 42, 6, 686-688, https://doi.org/10.1007/s10600-006-0252-x . [all data]

Ouamba, Ouabonzi, et al., 2006
Ouamba, J.-M.; Ouabonzi, A.; Ekouya, A.; Bessière, J.-M.; Menut, C.; Abena, A.A.; Banzouzi, J.-T., Volatile constituents of the essential oil leaf of Lantana salvifolia Jacq. (Verbenaceae), Flavour Fragr. J., 2006, 21, 1, 158-161, https://doi.org/10.1002/ffj.1553 . [all data]

Ozcan, Chalchat, et al., 2006
Ozcan, M.M.; Chalchat, J.-C.; Arslan, D.; Ates, A.; Unver, A., Comparative Essential Oil Composition and Antifungal Effect of Bitter Fennel (Foeniculum vulgare ssp. piperitum) Fruit Oils Obtained During Different Vegetation, J. Medicinal Food, 2006, 9, 4, 552-561, https://doi.org/10.1089/jmf.2006.9.552 . [all data]

Pala-Paul J., Perez-Alonso M.J., et al., 2006
Pala-Paul J.; Perez-Alonso M.J.; Velasco-Negueruela A.; Ballesteros M.T.; Sanz J., Essential oil composition of Sideritis hirsuta L. from Guadalajara Province, Spain, Flavour Fragr. J., 2006, 21, 3, 410-415, https://doi.org/10.1002/ffj.1727 . [all data]

Pino, Marquez, et al., 2006
Pino, J.A.; Marquez, E.; Marbot, R., Volatile constituents from tea of roselle (Hibiscus sabdariffa L.), Rev. CENIC Ciencias Quimicas, 2006, 37, 3, 127-129. [all data]

Pino, Marbot, et al., 2006
Pino, J.A.; Marbot, R.; Payo, A.; Chao, D.; Herrera, P., Aromatic Plants from Western Cuba VII. Composition of the Leaf Oil of Psidium wrightii KRug et Urb., Lantana involucrata L., Cinnamonum montanum (Sw.) Berchtold et J. Persl. and Caesalpinia violacea (Mill.) Standley, J. Essent. Oil. Res., 2006, 18, 2, 170-174, https://doi.org/10.1080/10412905.2006.9699058 . [all data]

Pino, Sauri-Duch, et al., 2006
Pino, J.; Sauri-Duch, E.; Marbot, R., Changes in volatile compounds of Habanero chile pepper (Capsicum chinense Jack. cv. Habanero) at two ripening stages, Food Chem., 2006, 94, 3, 394-398, https://doi.org/10.1016/j.foodchem.2004.11.040 . [all data]

Pitarokili, Tzakou, et al., 2006
Pitarokili, D.; Tzakou, O.; Loukis, A., Essential oil composition of Salvia verticillata, S. verbenaca, S. glutinosa and S. candidissima growing wild in Greece, Flavour Fragr. J., 2006, 21, 4, 670-673, https://doi.org/10.1002/ffj.1647 . [all data]

Potzernheim, Bizzo, et al., 2006
Potzernheim, M.C.L.; Bizzo, H.R.; Vieira, R.F., Analysis of the essential oil of three species of Piper collected in the region of the Distrito Federal (Cerrado - Brazilian Savannah) and comparison with oils of plants from region of Paraty, State of Rio de Janeiro (Atlantic Rain Forest), Brazilian Journal of Pharmacognosy, 2006, 16, 2, 246-251. [all data]

Robinson, 2006
Robinson, C.J., A new essential oil - Agonis fragrans, A report for the Rural Industries Research and Development Corporation, RIRDC Publication No. 06/090, Rural Industries Research and Development Corporation, Barton, ACT, 2006, 12. [all data]

Rout, Naik, et al., 2006
Rout, P.K.; Naik, S.N.; Rao, Y.R., Composition of the concrete, absolute, headspace and essential oil of the flowers of Michelia champaca Linn., Flavour Fragr. J., 2006, 21, 6, 906-911, https://doi.org/10.1002/ffj.1742 . [all data]

Sabulal, Dan, et al., 2006
Sabulal, B.; Dan, M.; Anil, J.J.; Kurup, R.; Pradeep, N.S.; Valsamma, R.K.; George, V., Caryophyllene-rich rhizome oil of Zingiber nimmonii from South India: Chemical characterization and antimicrobial activity, Phytochemistry, 2006, 67, 22, 2469-2473, https://doi.org/10.1016/j.phytochem.2006.08.003 . [all data]

Schmidt, Jirovetz, et al., 2006
Schmidt, E.; Jirovetz, L.; Buchbauer, G.; Eller, G.A.; Stoilova, I.; Krastanov, A.; Stoyanova, A.; Geisseler, M., Composition and antioxidant activities of the essential oil of cinnamon (Cinnamomum zeylanicum Blume) leaves from Sri Lanka, Jeobp, 2006, 9, 2, 170-182. [all data]

Sefidkon, Abbasi, et al., 2006
Sefidkon, F.; Abbasi, K.; Bakhshi Khaniki, G., Influence of drying and extraction methods on yield and chemical composition of the essential oil of Satureja hortensis, Food Chem., 2006, 99, 1, 19-23, https://doi.org/10.1016/j.foodchem.2005.07.026 . [all data]

Sefidkon and Jamzad, 2006
Sefidkon, F.; Jamzad, Z., Chemical composition of the essential oil of Gontscharovia popovii from Iran, Flavour Fragr. J., 2006, 21, 4, 619-621, https://doi.org/10.1002/ffj.1628 . [all data]

Sefidkon, Jamzad, et al., 2006
Sefidkon, F.; Jamzad, Z.; Mirza, M., Chemical composition of the essential oil of five Iranian Nepeta species (N. crispa, N. mahanensis, N. ispahanica, N. eremophila and N. rivularis), Flavour Fragr. J., 2006, 21, 5, 764-767, https://doi.org/10.1002/ffj.1668 . [all data]

Shafi, Jose, et al., 2006
Shafi, P.M.; Jose, B.; Radhamani, K.T.; Clery, R.A., Influence of pH on essential oil composition of Zanthoxylum rhetsa seeds obtained by steam distillation, Flavour Fragr. J., 2006, 21, 2, 317-318, https://doi.org/10.1002/ffj.1598 . [all data]

Silva, Oliveira, et al., 2006
Silva, N.A.; Oliveira, F.F.; Costa, L.C.B.; Bizzo, H.R.; Oliveira, R.A., Caracterização química do óleo essencial da erva cidreira (Lippia alba (Mill.) N. E. Br.) cultivada em Ilhéus na Bahia, Rev. Bras. Pl. Med., Botucatu, 2006, 8, 3, 52-55. [all data]

Tesso, König, et al., 2006
Tesso, H.; König, W.A.; Son, P.T.; Giang, P.M., Composition of the essential oil of flowers of Chloranthus spicatus (Thunb.) Makino, Flavour Fragr. J., 2006, 21, 4, 592-597, https://doi.org/10.1002/ffj.1528 . [all data]

Tesso, Kubeczka, et al., 2006
Tesso, H.; Kubeczka, K.-H.; König, W.A., A new phthalide from the essential oil of Meum athamanticum, Flavour Fragr. J., 2006, 21, 4, 622-625, https://doi.org/10.1002/ffj.1629 . [all data]

Tonzibo, Coffy, et al., 2006
Tonzibo, Z.F.; Coffy, A.A.; Chalachat, J.C.; N'guessan, Y.T., Chemical composition of essential oils of Hoslundia opposita Vahl. from Ivory Coast., Flavour Fragr. J., 2006, 21, 5, 789-791, https://doi.org/10.1002/ffj.1715 . [all data]

Tornambe, Cornu, et al., 2006
Tornambe, G.; Cornu, A.; Pradel, P.; Kondjoyan, N.; Carnat, A.P.; Petit, M.; Martin, B., Changes in Terpene Content in Milk from Pasture-Fed Cows, J. Dairy Sci., 2006, 89, 6, 2309-2319, https://doi.org/10.3168/jds.S0022-0302(06)72302-5 . [all data]

Trilles, Bombarda, et al., 2006
Trilles, B.L.; Bombarda, I.; Bouraïma-Madjebi, S.; Raharivelomanana, P.; Bianchini, J.-P.; Gaydou, E.M., Occurrence of various chemotypes in niaouli [Melaleuca quinquenervia (Cav.) S. T. Blake] essential oil from New Caledonia, Flavour Fragr. J., 2006, 21, 4, 677-682, https://doi.org/10.1002/ffj.1649 . [all data]

Wang, Yang, et al., 2006
Wang, Q.; Yang, Y.; Zhao, X.; Zhu, B.; Nan, P.; Zhao, J.; Wang, L.; Chen, F.; Liu, Z.; Zhong, Y., Chemical variation in the essential oil of Ephedra sinica from Northeastern China, Food Chem., 2006, 98, 1, 52-58, https://doi.org/10.1016/j.foodchem.2005.04.033 . [all data]

Wong, Lim, et al., 2006
Wong, K.C.; Lim, T.B.; Ali, D.M.H., Essential oil of Homalomena sagittifolia Jungh., Flavour Fragr. J., 2006, 21, 5, 786-788, https://doi.org/10.1002/ffj.1714 . [all data]

Wong, Sivasothy, et al., 2006
Wong, K.C.; Sivasothy, Y.; Boey, P.L., Essential oil of Elettariopsis elan C.K. Lim, Flavour Fragr. J., 2006, 21, 3, 562-564, https://doi.org/10.1002/ffj.1654 . [all data]

Yadegarinia, Gachkar, et al., 2006
Yadegarinia, D.; Gachkar, L.; Rezaei, M.B.; Taghizadeh, M.; Astaneh, S.A.; Rasooli, I., Biochemical activities of Iranian Mentha piperita L. and Myrtus communis L. essential oils, Phytochemistry, 2006, 67, 12, 1249-1255, https://doi.org/10.1016/j.phytochem.2006.04.025 . [all data]

Ahuja, Bakshi, et al., 2005
Ahuja, A.; Bakshi, S.K.; Sharma, S.K.; Thappa, R.K.; Agarwal, S.G.; Kichlu, S.K.; Paul, R.; Kaul, M.K., Production of volatile terpenes by proliferating shoots and micropropagated plants of Santolina chamaecyparissus L. (cotton lavender), Flavour Fragr. J., 2005, 20, 4, 403-406, https://doi.org/10.1002/ffj.1440 . [all data]

Askari and Sefidkon, 2005
Askari, F.; Sefidkon, F., Volatile components of Pimpinella tragium Vill. from Iran, Iran. J. Pharm. Res., 2005, 2, 117-120. [all data]

Basta, Tzakou, et al., 2005
Basta, A.; Tzakou, O.; Couladis, M., Composition of the leaves essential oil of Melissa officinalis s. l. from Greece, Flavour Fragr. J., 2005, 20, 6, 642-644, https://doi.org/10.1002/ffj.1518 . [all data]

Chagonda and Chalchat, 2005
Chagonda, L.S.; Chalchat, J.-C., The essential oil of wild and cultivated Hoslundia opposita Vahl. from Zimbabwe, Flavour Fragr. J., 2005, 20, 2, 193-195, https://doi.org/10.1002/ffj.1402 . [all data]

Chagonda and Chalchat, 2005, 2
Chagonda, L.S.; Chalchat, J.-C., The essential oil of the fruit of Garcinia huillensis Welw. ex. Oliv. from Zimbabwe, Flavour Fragr. J., 2005, 20, 3, 313-315, https://doi.org/10.1002/ffj.1420 . [all data]

Cornu, Kondjoyan, et al., 2005
Cornu, A.; Kondjoyan, N.; Martin, B.; Verdier-Metz, I.; Pradel, P.; Berdague, J.-L.; Coulon, J.-B., Terpene profiles in Cantal and Saint-Nectairetype cheese made from raw or pasteurised milk, J. Sci. Food Agric., 2005, 85, 12, 2040-2046, https://doi.org/10.1002/jsfa.2214 . [all data]

Dötterl and Jürgens, 2005
Dötterl, S.; Jürgens, A., Spatial fragrance patterns in flowers of Silene latifolia: Lilac compounds as olfactory nectar guides?, Plant Systematics and Evolution, 2005, 255, 1-2, 99-109, https://doi.org/10.1007/s00606-005-0344-2 . [all data]

Dötterl, Wolfe, et al., 2005
Dötterl, S.; Wolfe, L.M.; Jürgens, A., Qualitative and quantitative analyses of flower scent in Silene latifolia, Phytochemistry, 2005, 66, 2, 203-213, https://doi.org/10.1016/j.phytochem.2004.12.002 . [all data]

Duarte, Figueira, et al., 2005
Duarte, M.C.T.; Figueira, G.M.; Sartoratto, A.; Rehder, V.L.G.; Delarmelina, C., Anti-Candida activity of Brazilian medicinal plants, J. Ethnopharmacol., 2005, 97, 2, 305-311, https://doi.org/10.1016/j.jep.2004.11.016 . [all data]

Ferraz, Limberger, et al., 2005
Ferraz, A.B.F.; Limberger, R.P.; Bordignon, S.A.L.; von Poser, G.L.; Henriques, A.T., Essential oil composition of six Hypericum species from southern Brazil, Flavour Fragr. J., 2005, 20, 3, 335-339, https://doi.org/10.1002/ffj.1435 . [all data]

Ferretti, Maggi, et al., 2005
Ferretti, G.; Maggi, F.; Tirillini, B., Essential oil composition of Hypericum richeri Vill. from Italy, Flavour Fragr. J., 2005, 20, 3, 295-298, https://doi.org/10.1002/ffj.1412 . [all data]

Figuérédo, Cabassu, et al., 2005
Figuérédo, G.; Cabassu, P.; Chalchat, J.-C.; Pasquier, B., Studies of Mediterranean oregano populations- V. Chemical composition of essential oils of oregano: Origanum syriacum L. var. bevanii (Holmes) Ietswaart, O. syriacum L. var. sinaicum (Boiss.) Ietswaart, and O. syriacum L. var. syriacum from Lebanon and Israel, Flavour Fragr. J., 2005, 20, 164-168. [all data]

Gauvin and Smadja, 2005
Gauvin, A.; Smadja, J., Essential oil composition of four Psiadia species from Reunion Island: A chemotaxonomic study, Biochem. Syst. Ecol., 2005, 33, 7, 705-714, https://doi.org/10.1016/j.bse.2004.12.013 . [all data]

Ghasemi Y., Faridi P., et al., 2005
Ghasemi Y.; Faridi P.; Mehregan I.; Mohagheghzadeh A., Ferula gummosa fruits: An aromatic antimicrobial agent, Chem. Nat. Compd. (Engl. Transl.), 2005, 41, 3, 311-314, https://doi.org/10.1007/s10600-005-0138-3 . [all data]

Jassbi, Mehrdad, et al., 2005
Jassbi, A.R.; Mehrdad, M.; Soleimani, M.; Mirzaeian, M.; Sonboli, A., Chemical composition of the essential oils of Bunium elegans and Bunium caroides, Chem. Nat. Compd. (Engl. Transl.), 2005, 41, 4, 415-417, https://doi.org/10.1007/s10600-005-0165-0 . [all data]

Khayyat and Karimi, 2005
Khayyat, M.H.; Karimi, H., Composition of the volatile oils of three different species of Artemisia, Iranian Journal of Pharmaceutical Sciences, 2005, 1, 1, 29-32. [all data]

Khajeh, Yamini, et al., 2005
Khajeh, M.; Yamini, Y.; Bahramifar, N.; Sefidkon, F.; Reza Pirmoradei, M., Comparison of essential oils compositions of Ferula assa-foetida obtained by supercritical carbon dioxide extraction and hydrodistillation methods, Food Chem., 2005, 91, 4, 639-644, https://doi.org/10.1016/j.foodchem.2004.06.033 . [all data]

Pala-Paul, Perez-Alonso, et al., 2005
Pala-Paul, J.; Perez-Alonso, M.J.; Velasco-Negueruela, A.; Vadare, J.; Villa, A.M.; Sanz, J.; Brophy, J.J., Essential oil composition of the different parts of Eryngium bourgatii Gouan from Spain, J. Chromatogr. A, 2005, 1074, 1-2, 235-239, https://doi.org/10.1016/j.chroma.2005.03.036 . [all data]

Pellati, Benvenuti, et al., 2005
Pellati, F.; Benvenuti, S.; Yoshizaki, F.; Bertelli, D.; Rossi, M.C., Headspace solid-phase microextraction-gas chromatography-mass spectrometry analysis of the volatile compounds of Evodia species fruits, J. Chromatogr. A, 2005, 1087, 1-2, 265-273, https://doi.org/10.1016/j.chroma.2005.01.060 . [all data]

Pino, Marbot, et al., 2005
Pino, J.A.; Marbot, R.; Rosado, A.; Vázquez, C., Volatile constituents of genipap (Genipa americana L.) fruit from Cuba, Flavour Fragr. J., 2005, 20, 6, 583-586, https://doi.org/10.1002/ffj.1491 . [all data]

Rohloff and Bones, 2005
Rohloff, J.; Bones, A.M., Volatile profiling of Arabidopsis thaliana - Putative olfactory compounds in plant communication, Phytochemistry, 2005, 66, 16, 1941-1955, https://doi.org/10.1016/j.phytochem.2005.06.021 . [all data]

Safaei-Ghomi, Bamoniri, et al., 2005
Safaei-Ghomi, J.; Bamoniri, A.; Sarafraz, M.B.; Batooli, H., Volatile components from Artemisia scoparia Waldst et Kit growing in central Iran, Flavour Fragr. J., 2005, 20, 6, 650-652, https://doi.org/10.1002/ffj.1520 . [all data]

Sajjadi S.E. and Eskandari B., 2005
Sajjadi S.E.; Eskandari B., Chemical constituents of the essential oil of Nepeta oxyodonta, Chem. Nat. Compd. (Engl. Transl.), 2005, 41, 2, 175-177, https://doi.org/10.1007/s10600-005-0106-y . [all data]

Sajjadi and Ghannadi, 2005
Sajjadi, S.-E.; Ghannadi, A., Essential oil of the Persian sage, Salvia rhytidea Benth., Acta Pharm. Sin., 2005, 55, 321-326. [all data]

Sajjadi, 2005
Sajjadi, S.E., Analysis of the essential oil of Nepeta sintenisii Bornm. from Iran, DARU, 2005, 13, 2, 61-64. [all data]

Sefidkon and Jamzad, 2005
Sefidkon, F.; Jamzad, Z., Chemical composition of the essential oil of three Iranian Satureja species (S. mutica, S. macrantha and S. intermedia), Food Chem., 2005, 91, 1, 1-4, https://doi.org/10.1016/j.foodchem.2004.01.027 . [all data]

Setzer, Noletto, et al., 2005
Setzer, W.N.; Noletto, J.A.; Lawton, R.O.; Haber, W.A., Leaf essential oil composition of five Zanthoxylum species from Monteverde, Costa Rica, Molecular Diversity, 2005, 9, 1-3, 3-13, https://doi.org/10.1007/s11030-005-1298-6 . [all data]

Simoes-Pires C.A., Debenedetti S., et al., 2005
Simoes-Pires C.A.; Debenedetti S.; Spegazzini E.; Mentz L.A.; Matzenbacher N.I.; Limberger R.P.; Henriques A.T., Investigation of the essential oil from eight species of Baccharis belonging to sect. Caulopterae (Asteraceae, Astereae): a taxonomic approach, Plant Systematics and Evolution, 2005, 253, 1-4, 23-32, https://doi.org/10.1007/s00606-005-0296-6 . [all data]

Skoula and Grayer, 2005
Skoula, M.; Grayer, R.J., Volatile oils of Coridothymus capitatus, Satureja thymbra, Satureja spinosa and Thymbra calostachya (Lamiaceae) from Crete, Flavour Fragr. J., 2005, 20, 6, 573-576, https://doi.org/10.1002/ffj.1489 . [all data]

Slavkovska, Couladis, et al., 2005
Slavkovska, V.; Couladis, M.; Bojovic, S.; Tzakou, O.; Pavlovic, M.; Lakusic, B.; Jancic, R., Essential oil and its systematic significance in species of Micromeria Bentham from Serbia Montenegro, Plant Systematics and Evolution, 2005, 255, 1-2, 1-15, https://doi.org/10.1007/s00606-005-0303-y . [all data]

Srivastava, Srivastava, et al., 2005
Srivastava, A.K.; Srivastava, S.K.; Syamsundar, K.V., Bud and leaf essential oil composition of Syzygium aromaticum from India and Madagascar, Flavour Fragr. J., 2005, 20, 1, 51-53, https://doi.org/10.1002/ffj.1364 . [all data]

Stevanovic, Garneau, et al., 2005
Stevanovic, T.; Garneau, F.-X.; Jean, F.-I.; Gagnon, H.; Vilotic, D.; Petrovic, S.; Ruzic, N.; Pichette, A., The essential oil composition of Pinus mugo Turra from Serbia, Flavour Fragr. J., 2005, 20, 1, 96-97, https://doi.org/10.1002/ffj.1390 . [all data]

Topçu, Barla, et al., 2005
Topçu, G.; Barla, A.; Gören, A.C.; Bilsel, G.; Bilsel, M.; Tümen, G., Analysis of the essential oil composition of Sideritis albiflora using direct thermal desorption and headspace GC-MS techniques, Turk. J. Chem., 2005, 29, 525-529. [all data]

Tzakou, Bazos, et al., 2005
Tzakou, O.; Bazos, I.; Yannitsaros, A., Essential oils of leaves, inflorescences and infructescences of spontaneous Cotinus coggygria Scop. from Greece, Flavour Fragr. J., 2005, 20, 5, 531-533, https://doi.org/10.1002/ffj.1456 . [all data]

Tzakou and Constantinidis, 2005
Tzakou, O.; Constantinidis, T., Chemotaxonomic significance of volatile compounds in Thymus samius and its related species Thymus atticus and Thymus parnassicus, Biochem. Syst. Ecol., 2005, 33, 11, 1131-1140, https://doi.org/10.1016/j.bse.2005.03.008 . [all data]

Urdampilleta, Amat, et al., 2005
Urdampilleta, J.D.; Amat, A.G.; Bidau, C.J.; Koslobsky, N.K., Biosystematic and chemosystematic studies in five South Americal species of Conyza (Asteraceae), Bol. Soc. Argent. Bot., 2005, 40, 1-2, 101-107. [all data]

Velasco-Negueruela, Pérez-Alonso, et al., 2005
Velasco-Negueruela, A.; Pérez-Alonso, M.J.; Palá-Paúl, J.; Iñigo, A.; López, G., The volatile oil composition of the berries of Juniperus macrocarpa Sibth. and Sm., gathered in Spain, J. Essent. Oil Res., 2005, 17, 1, 61-63, https://doi.org/10.1080/10412905.2005.9698831 . [all data]

Vichi, Riu-Aumatell, et al., 2005
Vichi, S.; Riu-Aumatell, M.; Mora-Pons, M.; Buxaderas, S.; Lopez-Tamames, E., Characterization of Volatiles in Different Dry Gins, J. Agric. Food Chem., 2005, 53, 26, 10154-10160, https://doi.org/10.1021/jf058121b . [all data]

Wong, Lee, et al., 2005
Wong, K.C.; Lee, B.C.; Lam, N.F.; Ibrahim, P., Essential oils of the rhizomes of Alpinia conchigera Griff. and Alpinia latilabris Ridl., Flavour Fragr. J., 2005, 20, 4, 431-433, https://doi.org/10.1002/ffj.1458 . [all data]

Abreu, Reis, et al., 2004
Abreu, I.N.; Reis, M.G.; Marsaioli, A.J.; Mazzafera, P., Essential oil composition of Hypericum brasiliense choise, Flavour Fragr. J., 2004, 19, 1, 80-82, https://doi.org/10.1002/ffj.1319 . [all data]

Agnihotri, Thappa, et al., 2004
Agnihotri, V.K.; Thappa, R.K.; Meena, B.; Kapahi, B.K.; Saxena, R.K.; Qazi, G.N.; Agarwal, S.G., Essential oil composition of aerial parts of Angelica glauca growing wild in North-West Himalaya (India), Phytochemistry, 2004, 65, 16, 2411-2413, https://doi.org/10.1016/j.phytochem.2004.07.004 . [all data]

Blanc, Muselli, et al., 2004
Blanc, M.-C.; Muselli, A.; Bradesi, P.; Casanova, J., Chemical composition and variability of the essential oil of Inula graveolens from Corsica, Flavour Fragr. J., 2004, 19, 4, 314-319, https://doi.org/10.1002/ffj.1304 . [all data]

Cakir, Kordali, et al., 2004
Cakir, A.; Kordali, S.; Zengin, H.; Izumi, S.; Hirata, T., Composition and antifungal activity of essential oils isolated from Hypericum hyssopifolium and Hypericum heterophyllum, Flavour Fragr. J., 2004, 19, 1, 62-68, https://doi.org/10.1002/ffj.1279 . [all data]

Cicció, 2004
Cicció, J.F., A source of almost pure methyl chavicol: volatile oil from the aerial parts of Tagetes lucida (Asteraceae) cultivated in Costa Rica, Rev. Biol. Trop., 2004, 52, 4, 853-857, retrieved from http://www.tropiweb.com. [all data]

Gauvin, Ravaomanarivo, et al., 2004
Gauvin, A.; Ravaomanarivo, H.; Smadja, J., Comparative analysis by gas chromatography?mass spectrometry of the essential oils from bark and leaves of Cedrelopsis grevei Baill, an aromatic and medicinal plant from Madagascar, J. Chromatogr. A, 2004, 1029, 1-2, 279-282, https://doi.org/10.1016/j.chroma.2003.12.012 . [all data]

González, Guerra, et al., 2004
González, S.; Guerra, P.E.; Bottaro, H.; Molares, S.; Demo, M.S.; Oliva, M.M.; Zunino, M.P.; Zygadlo, J.A., Aromatic plants from Patagonia. Part I. Antimicrobial activity and chemical composition of Schinus polygamus (Cav.) Cabrera essential oil, Flavour Fragr. J., 2004, 19, 1, 36-39, https://doi.org/10.1002/ffj.1270 . [all data]

JAvidnia, Mojab, et al., 2004
JAvidnia, K.; Mojab, F.; Mojahedi, S.A., Chemical constituents of the essential oil of Stachys lavandulifolia Vahl from Iran, Iranian J. Pharm. Res., 2004, 3, 61-63. [all data]

Jürgens and Dötterl, 2004
Jürgens, A.; Dötterl, S., Chemical composition of anther volatiles in Ranunculaceae: genera-specific profiles in Aemone, Aquilegia, Caltha, Pulsatilla, Ranunculus, and Trollius species, American Journal of Botany, 2004, 91, 12, 1969-1980, https://doi.org/10.3732/ajb.91.12.1969 . [all data]

Kalvandi, Sefidkon, et al., 2004
Kalvandi, R.; Sefidkon, F.; Atri, M.; Mirza, M., Analysis of the essential oil of Thymus eriocalyx from Iran, Flavour Fragr. J., 2004, 19, 4, 341-343, https://doi.org/10.1002/ffj.1312 . [all data]

Kalemba and Thiem, 2004
Kalemba, D.; Thiem, B., Constituents of the essential oils of four micropropagated Solidago species, Flavour Fragr. J., 2004, 19, 1, 40-43, https://doi.org/10.1002/ffj.1271 . [all data]

Kilic, Hafizoglu, et al., 2004
Kilic, A.; Hafizoglu, H.; Kollmannsberger, H.; Nitz, S., Volatile constituents and key odorants in leaves, buds, flowers, and fruits of Laurus nobilis L., J. Agric. Food Chem., 2004, 52, 6, 1601-1606, https://doi.org/10.1021/jf0306237 . [all data]

Lis, Boczek, et al., 2004
Lis, A.; Boczek, E.; Góra, J., Chemical composition of the essential oils from fruits, leaves and flowers of the Amur cork tree (Phellodendron amurense Rupr.), Flavour Fragr. J., 2004, 19, 6, 549-553, https://doi.org/10.1002/ffj.1349 . [all data]

Lopez Arze, Collin, et al., 2004
Lopez Arze, J.B.; Collin, G.; Garneau, F.-X.; Jean, F.-I.; Gagnon, H., Essential oils from Bolivia. II. Asteraceae: Ophryosporus heptanthus (Wedd.) H. Rob. et King, J. Essent. Oil Res., 2004, 16, 4, 374-376, https://doi.org/10.1080/10412905.2004.9698747 . [all data]

Marongiu, Piras, et al., 2004
Marongiu, B.; Piras, A.; Porcedda, S., Comparative analysis of the oil and supercritical CO2 extract of Elettaria cardamomum (L.) maton, J. Agric. Food Chem., 2004, 52, 20, 6278-6282, https://doi.org/10.1021/jf034819i . [all data]

Nik, Mirza, et al., 2004
Nik, Z.B.; Mirza, M.; Shahmir, F., Essential oil of Marrubium cuneatum Russell and its secretory elements, Flavour Fragr. J., 2004, 19, 3, 233-235, https://doi.org/10.1002/ffj.1293 . [all data]

Palá-Paúl, García-Jiménez, et al., 2004
Palá-Paúl, J.; García-Jiménez, R.; Pérez-Alonso, M.J.; Velasco-Negueruela, A.; Sanz, J., Essential oil composition of the leaves and stems of Meum athamanticum Jacq., from Spain, J. Chromatogr. A, 2004, 1036, 2, 245-247, https://doi.org/10.1016/j.chroma.2004.02.064 . [all data]

Palá-Paúl, Velasco-Negueruela, et al., 2004
Palá-Paúl, J.; Velasco-Negueruela, A.; Pérez-Alonso, M.J.; Maqueda, J.; Sanz, J., Volatile oil constituents from different parts of Cachrys trifida L., J. Essent. Oil Res., 2004, 16, 4, 347-349, https://doi.org/10.1080/10412905.2004.9698738 . [all data]

Raal, Arak, et al., 2004
Raal, A.; Arak, E.; Orav, A., Chemical composition of coriander seed essential oil and their conformity with EP standards, Agraarteadus, 2004, 15, 4, 234-239. [all data]

Raal, Paaver, et al., 2004
Raal, A.; Paaver, U.; Arak, E.; Orav, A., Content and composition of the essential oil of Thymus serpyllum L. growing wild in Estonia, Medicina (Kaunas), 2004, 40, 8, 795-800. [all data]

Robledo and Arzuffi, 2004
Robledo, N.; Arzuffi, R., Identificacion de los compuestos volatiles de papaya y cuaguayote mediante microextraccion en fase solida, cromatografia de gases y espectrometria de masas, Rev. Latinoamericana Quim., 2004, 32, 1, 30-36. [all data]

Sadeghpour, Asghari, et al., 2004
Sadeghpour, O.; Asghari, G.; Ardekani, M.R.S., Composition of essential oil of Artemisia persica Boiss. from Iran, Iran. J. Pharm. Res., 2004, 3, 65-67. [all data]

Sefidkon, Jamzad, et al., 2004
Sefidkon, F.; Jamzad, Z.; Mirza, M., Chemical variation in the essential oil of Satureja sahendica from Iran, Food Chem., 2004, 88, 3, 325-328, https://doi.org/10.1016/j.foodchem.2003.12.044 . [all data]

Suyenaga, Apel, et al., 2004
Suyenaga, E.S.; Apel, M.A.; Chaves, C.G.; Zuanazzi, J.A.; Henriques, A.T., Essential oil composition of Heterothalamus psiadioides Less, Biochem. Syst. Ecol., 2004, 32, 1, 83-86, https://doi.org/10.1016/S0305-1978(03)00190-X . [all data]

Tirillini, Pellegrino, et al., 2004
Tirillini, B.; Pellegrino, R.; Bini, L.M., Essential oil composition of Stachys sylvatica L. from Italy, Flavour Fragr. J., 2004, 19, 4, 330-332, https://doi.org/10.1002/ffj.1308 . [all data]

Wang and Guo-Y. -L., 2004
Wang, H.-Y.; Guo-Y. -L., Rapid analysis of the volatile compounds in the rhizomes of Rhodiola sachalinensis and Rhodiola sacra by static headspace-gas chromatography-tandem mass spectrometry, Anal. Letters, 2004, 37, 10, 2151-2161, https://doi.org/10.1081/AL-200026690 . [all data]

Wang, Guo, et al., 2004
Wang, H.; Guo, Y.; Zhang, Z.; An, D., Fast analysis of volatile compounds in natural essences by automatic Static-Headspace-GC-MS, J. Instrum. Anal. (Chinese), 2004, 23, 1, 9-13. [all data]

Cabanillas, Lopez, et al., 2003
Cabanillas, C.M.; Lopez, M.L.; Daniele, G.; Zygadlo, J.A., Essential oil composition of Aloysia polystachya (Griseb.) Moldenke under rust disease, Flavour Fragr. J., 2003, 18, 5, 446-448, https://doi.org/10.1002/ffj.1249 . [all data]

Couladis, Özcan, et al., 2003
Couladis, M.; Özcan, M.; Tzakou, O.; Akgül, A., Comparative essential oil composition of various parts of the turpentine tree (Pistacia terebinthus L) growing wild in Turkey, J. Sci. Food Agric., 2003, 83, 2, 136-138, https://doi.org/10.1002/jsfa.1295 . [all data]

Dabiri and Sefidkon, 2003
Dabiri, M.; Sefidkon, F., Chemical composition of the essential oil of Nepeta racemosa Lam. from Iran, Flavour Fragr. J., 2003, 18, 2, 157-158, https://doi.org/10.1002/ffj.1151 . [all data]

Dabiri and Sefidkon, 2003, 2
Dabiri, M.; Sefidkon, F., Chemical compositional of Nepeta crassifolia Boiss. Buhse oil from Iran, Flavour Fragr. J., 2003, 18, 3, 225-227, https://doi.org/10.1002/ffj.1199 . [all data]

Dudai, Larkov, et al., 2003
Dudai, N.; Larkov, O.; Chaimovitsh, D.; Lewinsohn, E.; Freiman, L.; Ravid, U., Essential oil compounds of Origanum dayi Post, Flavour Fragr. J., 2003, 18, 4, 334-337, https://doi.org/10.1002/ffj.1237 . [all data]

Edris, Shalaby, et al., 2003
Edris, A.E.; Shalaby, A.; Fadel, H.M., Effect of organic agriculture practices on the volatile aroma components of some essential oil plants growing in Egypt II: sweet Marjoram (Origanum marjorana L.) essential oil, Flavour Fragr. J., 2003, 18, 4, 345-351, https://doi.org/10.1002/ffj.1235 . [all data]

Edris, Shalaby, et al., 2003, 2
Edris, A.E.; Shalaby, A.S.; Fadel, H.M.; Abdel-Wahab, M.A., Evaluation of a chemotype of spearmint (Mentha spicata L.) grown in Siwa Oasis, Egypt, Eur. Food Res. Technol., 2003, 218, 1, 74-78, https://doi.org/10.1007/s00217-003-0802-4 . [all data]

Feizbaksh, Saber Tehrani, et al., 2003
Feizbaksh, A.; Saber Tehrani, M.; Rustaiyan, A.; Masoudi, S., Composition of the essential oil of Stachys lavandulifolia Vahl. from Iran, J. Essent. Oil Res., 2003, 15, 2, 72-73, https://doi.org/10.1080/10412905.2003.9712068 . [all data]

Fekam Boyom, Amvam Zollo, et al., 2003
Fekam Boyom, F.; Amvam Zollo, P.H.; Agnaniet, H.; Menut, C.; Bessière, J.M., Aromatic plants of tropical central Africa. Part XLIII volatiles components from Uvariastrum pierreanum Engl. (Engl. Diels) growing in Cameroon, Flavour Fragr. J., 2003, 18, 4, 296-298, https://doi.org/10.1002/ffj.1218 . [all data]

Fekam Boyom, Ngouana, et al., 2003
Fekam Boyom, F.; Ngouana, V.; Amvam Zollo, P.H.; Menut, C.; Bessiere, J.M.; Gut, J.; Rosenthal, P.J., Composition and anti-plasmodial activities of essential oils from some Cameroonian medicinal plants, Phytochemistry, 2003, 64, 7, 1269-1275, https://doi.org/10.1016/j.phytochem.2003.08.004 . [all data]

Ghannadi, Aghazari, et al., 2003
Ghannadi, A.; Aghazari, F.; Mehrabani, M.; Mohagheghzadeh, A.; Mehregan, I., Quantity and composition of the SDE prepared essential oil of Nepeta macrosiphon Boiss, Iran. J. Pharm. Res., 2003, 2, 103-105. [all data]

Ghannadi and Zolfaghari, 2003
Ghannadi, A.; Zolfaghari, B., Compositional analysis of the essential oil of Lallemantia royleana (Benth. in Wall.) Benth. from Iran, Flavour Fragr. J., 2003, 18, 3, 237-239, https://doi.org/10.1002/ffj.1215 . [all data]

Hajhashemi, Ghannadi, et al., 2003
Hajhashemi, V.; Ghannadi, A.; Sharif, B., Anti-inflammatory and analgesic properties of the leaf extracts and essential oil of Lavandula angustifolia Mill., J. Ethnopharmacol., 2003, 89, 1, 67-71, https://doi.org/10.1016/S0378-8741(03)00234-4 . [all data]

Jirovetz, Buchbauer, et al., 2003
Jirovetz, L.; Buchbauer, G.; Shafi, M.P.; Kaniampady, M.M., Chemotaxonomical analysis of the essential oil aroma compounds of four different Ocimumspecies from southern India, Eur. Food Res. Technol., 2003, 217, 2, 120-124, https://doi.org/10.1007/s00217-003-0708-1 . [all data]

Jirovetz, Buchbauer, et al., 2003, 2
Jirovetz, L.; Buchbauer, G.; Shafi, M.P.; Leela, N.K., Analysis of the essential oils of the leaves, stems, rhizomes and roots of the medicinal plant Alpinia galanga from southern India, Acta Pharm. Hung., 2003, 53, 73-81. [all data]

Kanjilal, Kotoky, et al., 2003
Kanjilal, P.B.; Kotoky, R.; Singh, R.S., Chemical composition of the leaf oil of Altingia excelsa Nornha, Flavour Fragr. J., 2003, 18, 5, 449-450, https://doi.org/10.1002/ffj.1250 . [all data]

Lago, de Ávila, et al., 2003
Lago, J.H.G.; de Ávila, P., Jr.; Moreno, P.R.H.; Limberger, R.P.; Apel, M.A.; Henriques, A.T., Analysis, comparison and variation on the chemical composition from the leaf volatile oil of Xylopia aromatica (Annonaceae), Biochem. Syst. Ecol., 2003, 31, 6, 669-672, https://doi.org/10.1016/S0305-1978(02)00267-3 . [all data]

Maia, Taveira, et al., 2003
Maia, J.G.S.; Taveira, F.S.N.; Andrade, E.H.A.; da Silva, M.H.L.; Zoghbi, M.G.B., Essential oils of Lippia grandis Schau., Flavour Fragr. J., 2003, 18, 5, 417-420, https://doi.org/10.1002/ffj.1241 . [all data]

Masotti, Juteau, et al., 2003
Masotti, V.; Juteau, F.; Bessière, J.M.; Viano, J., Seasonal and phenological variations of the essential oil from the narrow endemic species Artemisia molinieri and its biological activities, J. Agric. Food Chem., 2003, 51, 24, 7115-7121, https://doi.org/10.1021/jf034621y . [all data]

Mierendorff, Stahl-Biskup, et al., 2003
Mierendorff, H.-G.; Stahl-Biskup, E.; Posthumus, M.A.; van Beek, T.A., Composition of commercial Cape chamomile oil (Eriocephalus punctulatus), Flavour Fragr. J., 2003, 18, 6, 510-514, https://doi.org/10.1002/ffj.1259 . [all data]

Mirza, Nik, et al., 2003
Mirza, M.; Nik, Z.B.; Dini, M., Chemical composition of the essential oils of astrodaucus orientalis (L.) Drude leaves and seeds, Flavour Fragr. J., 2003, 18, 3, 205-206, https://doi.org/10.1002/ffj.1184 . [all data]

Mookdasanit, Tamura, et al., 2003
Mookdasanit, J.; Tamura, H.; Yoshizawa T.; Tokunaga T.; Nakanishi, K., Trace Volatile Compounds in Essential Oil of Citrus Sudachi by Means of Modified Solvent Extraction Method, Food Sci Technol. Res., 2003, 9, 1, 54-61, https://doi.org/10.3136/fstr.9.54 . [all data]

Orav, Kailas, et al., 2003
Orav, A.; Kailas, T.; Jegorova, A., Composition of the essential oil of dill, celery, and parsley from Estonia, Proc. Est. Acad. Sci. Chem., 2003, 52, 4, 147-154. [all data]

Pino, Marbot, et al., 2003
Pino, J.A.; Marbot, R.; Fuentes, V., Characterization of volatiles in Bullock's heart (Annona reticulata L.) fruit cultivars from Cuba, J. Agric. Food Chem., 2003, 51, 13, 3836-3839, https://doi.org/10.1021/jf020733y . [all data]

Pitarokili, Tzakou, et al., 2003
Pitarokili, D.; Tzakou, O.; Loukis, A.; Harvala, C., Volatile metabolites from Salvia fruticosa as antifungal agents in soilborne pathogens, J. Agric. Food Chem., 2003, 51, 11, 3294-3301, https://doi.org/10.1021/jf0211534 . [all data]

Pourmortazavi, Sefidkon, et al., 2003
Pourmortazavi, S.M.; Sefidkon, F.; Hosseini, S.G., Supercritical carbon dioxide extraction of essential oils from Perovskia atriplicifolia Benth., J. Agric. Food Chem., 2003, 51, 18, 5414-5419, https://doi.org/10.1021/jf0341619 . [all data]

Priestap, van Baren, et al., 2003
Priestap, H.A.; van Baren, C.M.; Lira, P.D.L.; Coussio, J.D.; Bandoni, A.L., Volatile constituents of Aristolochia argentina, Phytochemistry, 2003, 63, 2, 221-225, https://doi.org/10.1016/S0031-9422(02)00751-3 . [all data]

Raal, Arak, et al., 2003
Raal, A.; Arak, E.; Orav, A.; Ivask, K., Comparison of essential oil content of Matricaria recutita L. from different origins, Ars Pharm., 2003, 44, 2, 159-165, retrieved from http://www.ugr.es/~ars/abstract/44-159-03.pdf. [all data]

Sadraei, Ghannadi, et al., 2003
Sadraei, H.; Ghannadi, A.; Malekshahi, K., Composition of the essential oil of Asa-foetida and its spasmolytic action, Saudi Pharmaceutical Journal, 2003, 11, 3, 136-140. [all data]

Sajjadi and Mehregan, 2003
Sajjadi, S.E.; Mehregan, I., Chemical composition of the essential oil of Prangos Asperula Boiss. subsp. haussknechtii (Boiss.) Hernst. et Heyn fruits, 2003, retrieved from http://www1.tums.ac.ir/daru/daru2%2020003/Dr%20Sajadi.PDF. [all data]

Shahmir, Ahmadi, et al., 2003
Shahmir, F.; Ahmadi, L.; Mirza, M.; Korori, S.A.A., Secretory elements of needles and berries of Juniperus communis L. ssp. communis and its volatile constituents, Flavour Fragr. J., 2003, 18, 5, 425-428, https://doi.org/10.1002/ffj.1243 . [all data]

da Silva, Luz, et al., 2003
da Silva, J.D.; Luz, A.I.R.; da Silva, M.H.L.; Andrade, E.H.A.; Soghbi, M.G.B.; Maia, J.G.S., Essential oils of the leaves and stems of four Psidium spp., Flavour Fragr. J., 2003, 18, 3, 240-243, https://doi.org/10.1002/ffj.1219 . [all data]

Stashenko, Jaramillo, et al., 2003
Stashenko, E.E.; Jaramillo, B.E.; Martínez, J.R., Comparación de la composición química y de la actividad antioxidante in vitro de los metabolitos secundarios volátiles de plantas de la familia verbenaceae, Rev. Acad. Colomb. Cienc. Exactas Fis. Nat., 2003, 27, 105, 579-597. [all data]

Velasco-Negueruela, Pérez-Alonso, et al., 2003
Velasco-Negueruela, A.; Pérez-Alonso, M.J.; Pérez de Paz, P.L.; Palá-Paúl, J.; Sanz, J., Analysis by gas chromatography-mass spectrometry of the essential oils from the aerial parts of Rutheopsis herbanica (Bolle) Hans. Kunk., gathered in Fuerteventura (Canary Islands), J. Chromatogr. A, 2003, 984, 1, 159-162, https://doi.org/10.1016/S0021-9673(02)01742-9 . [all data]

Velickovic, Randjelovic, et al., 2003
Velickovic, D.T.; Randjelovic, N.V.; Ristic, M.S.; Velickovic, A.S.; Smelcerovic, A.A., Chemical constituents and antimicrobial activity of the ethanol extracts obtained from the flower, leaf, and stem of Salvia officinalis L., J. Serb. Chem. Soc., 2003, 68, 1, 17-24, https://doi.org/10.2298/JSC0301017V . [all data]

Velickovic, Ristic, et al., 2003
Velickovic, A.S.; Ristic, M.S.; Velickovic, D.T.; Ilic, S.; Mitic, N.D., The possibilities of the application of some species of sage (Salvia L.) as auxiliaries in the treatment of some diseases, J. Serb. Chem. Soc., 2003, 68, 6, 435-445, https://doi.org/10.2298/JSC0306435V . [all data]

Yassa, Akhani, et al., 2003
Yassa, N.; Akhani, H.; Aqaahmadi, M.; Salimian, M., Essential oils from two endemic species of Apiaceae from Iran, Z. Naturforsch. C:, 2003, 58, 459-463. [all data]

Zoghbi, Andrade, et al., 2003
Zoghbi, M.G.B.; Andrade, E.H.A.; da Silva, M.H.; Carreira, L.M.M.; Maia, J.G.S., Essential oils from three Myrcia species, Flavour Fragr. J., 2003, 18, 5, 421-424, https://doi.org/10.1002/ffj.1242 . [all data]

Baher, Mirza, et al., 2002
Baher, Z.F.; Mirza, M.; Ghorbanli, M.; Rezaii, M.B., The influence of water stress on plant height, herbal and essential oil yield and composition in Satureja hortensis L., Flavour Fragr. J., 2002, 17, 4, 275-277, https://doi.org/10.1002/ffj.1097 . [all data]

Bloss, Acree, et al., 2002
Bloss, J.; Acree, T.E.; Bloss, J.M.; Hood, W.R.; Kunz, T.H., Potential use of chemical cues for colony-mate recognition in the big brown bat, Eptesicus fuscus, J. Chem. Ecol., 2002, 28, 4, 819-834, https://doi.org/10.1023/A:1015296928423 . [all data]

Boyom, Keumedjio, et al., 2002
Boyom, F.F.; Keumedjio, F.; Dongmo, P.M.J.; Ngadjui, B.T.; Zollo, A.; Menut, C.; Bessiere, J.M., Essential oils from Croton zambesicus Muell. Arg. growing in Cameroon, Flavour Fragr. J., 2002, 17, 3, 215-217, https://doi.org/10.1002/ffj.1081 . [all data]

Cavaleiro, Salgueiro, et al., 2002
Cavaleiro, C.; Salgueiro, L.; Barroso, J.G.; Figueiredo, A.C.; Pedro, L.G.; Fontinha, S.S.; Bighelli, A.; Casanova, J.; Looman, A.; Scheffer, J.J.C., Composition of the essential oil of Juniperus cedrus Webb and Berth. grown on Madeira, Flavour Fragr. J., 2002, 17, 2, 111-114, https://doi.org/10.1002/ffj.1061 . [all data]

Cicció and Gómez-Laurito, 2002
Cicció, J.F.; Gómez-Laurito, J., Volatile constituents of the leaves of Siparuna thecaphora (Siparunaceae) from Turrialba, Costa Rica, Rev. Biol. Trop., 2002, 50, 3/4, 963-967. [all data]

Das, Ram, et al., 2002
Das, M.; Ram, G.; Singh, A.; Mallavarapu, G.R.; Ramesh, S.; Ram, M.; Kumar, S., Volatile constituents of different plant parts of Chamomilla recutita L. Rausch grown in the Indo-Gangetic plains, Flavour Fragr. J., 2002, 17, 1, 9-12, https://doi.org/10.1002/ffj.1035 . [all data]

Flamini, Ertugrul, et al., 2002
Flamini, G.; Ertugrul, K.; Cioni, P.L.; Morelli, I.; Dural, H.; Bagci, Y., Volatile constituents of two endemic Centaurea species from Turkey: C. pseudoscabiosa subsp. pseudoscabiosa and C. hadimensis, Biochem. Syst. Ecol., 2002, 30, 10, 953-959, https://doi.org/10.1016/S0305-1978(02)00043-1 . [all data]

Gancel, Ollé, et al., 2002
Gancel, A.-L.; Ollé, D.; Ollitrault, P.; Luro, F.; Brillouet, J.-M., Leaf and peel volatile compounds of an interspecific citrus somatic hybrid [Citrus aurantifolia (Christm.) Swing. + Citrus paradisi Macfayden], Flavour Fragr. J., 2002, 17, 6, 416-424, https://doi.org/10.1002/ffj.1119 . [all data]

Iñigo, Palá-Paúl, et al., 2002
Iñigo, A.; Palá-Paúl, J.; Pérez-Alonso, M.J.; Velasco-Negueruela, A., Essential oil composition from the aerial parts of Haplophyllum linifolium (L.) G. Don fil., Botanica Complutensis, 2002, 26, 79-83. [all data]

Isidorov and Jdanova, 2002
Isidorov, V.; Jdanova, M., Volatile organic compounds from leaves litter, Chemosphere, 2002, 48, 9, 975-979, https://doi.org/10.1016/S0045-6535(02)00074-7 . [all data]

Jirovetz, Buchbauer, et al., 2002
Jirovetz, L.; Buchbauer, G.; Ngassoum, M.B.; Geissler, M., Aroma compound analysis of Piper nigrum and Piper guineense essential oils from Cameroon using solid-phase microextraction-gas chromatography, solid-phase microextraction-gas chromatography-mass spectrometry and olfactometry, J. Chromatogr. A, 2002, 976, 1-2, 265-275, https://doi.org/10.1016/S0021-9673(02)00376-X . [all data]

Jirovetz, Ngassoum, et al., 2002
Jirovetz, L.; Ngassoum, M.B.; Geissler, M., Analysis of the headspace aroma compounds of the seeds of the Cameroonian garlic plant Hua gabonii using SPME/GC/FID, SPME/GC/MS and olfactometry, Eur. Food Res. Technol., 2002, 214, 3, 212-215, https://doi.org/10.1007/s00217-001-0481-y . [all data]

Juteau, Masotti, et al., 2002
Juteau, F.; Masotti, V.; Bessière, J.-M., Compositional characteristics of the essential oil of Artemisia campestris var. glutinosa, Biochem. Syst. Ecol., 2002, 30, 11, 1065-1070, https://doi.org/10.1016/S0305-1978(02)00052-2 . [all data]

Krauze-Baranowska, Mardarowicz, et al., 2002
Krauze-Baranowska, M.; Mardarowicz, M.; Wiwart, M., The chemical composition of Microbiota decussata, Z. Naturforsch. C:, 2002, 57c, 998-1003. [all data]

Kuiate, Bessière, et al., 2002
Kuiate, J.-R.; Bessière, J.-M.; Zollo, P.-H.A., Composition of the essential oils from three Laggera Spp. from Cameroon, Flavour Fragr. J., 2002, 17, 2, 105-108, https://doi.org/10.1002/ffj.1057 . [all data]

Lin, Rouseff, et al., 2002
Lin, J.; Rouseff, R.L.; Barros, S.; Naim, M., Aroma composition changes in early season grapefruit juice produced from thermal concentration, J. Agric. Food Chem., 2002, 50, 4, 813-819, https://doi.org/10.1021/jf011154g . [all data]

Maia, da Silva, et al., 2002
Maia, J.G.S.; da Silva, M.H.L.; Andrade, E.H.A.; Zoghbi, M.G.B.; Carreira, L.M.M., Essential oils from Astronium urundeuva (Allemao) Engl. and A. fraxinifolium Schott ex Spreng., Flavour Fragr. J., 2002, 17, 1, 72-74, https://doi.org/10.1002/ffj.1046 . [all data]

Maia, Zoghbi, et al., 2002
Maia, J.G.S.; Zoghbi, M.G.B.; Andrade, E.H.A.; da Silva, M.H.L.; Luz, A.I.R.; da Silva, J.D., Essential oils composition of Eupatorium species growing wild in the Amazon, Biochem. Syst. Ecol., 2002, 30, 11, 1071-1077, https://doi.org/10.1016/S0305-1978(02)00059-5 . [all data]

Norouzi-Arasi, Yavari, et al., 2002
Norouzi-Arasi, H.; Yavari, I.; Ghaffarzadeh, F.; Mortazavi, M.-S., Volatile constituents of Cymbopogon olivieri (Boiss.) Bor from Iran, Flavour Fragr. J., 2002, 17, 4, 272-274, https://doi.org/10.1002/ffj.1096 . [all data]

Orav, Kailas, et al., 2002
Orav, A.; Kailas, T.; Müürisepp, M., Composition of blackcurrant aroma isolated from leaves, buds, and berries of Ribes nigrum L., Proc. Est. Acad. Sci. Chem., 2002, 51, 4, 225-234. [all data]

Priestap, van Baren, et al., 2002
Priestap, H.A.; van Baren, C.M.; Lira, P.D.L.; Prado, H.J.; Neugebauer, M.; Mayer, R.; Bandoni, A.L., Essential oils from aerial parts of Aristolochia gibertii Hook., Flavour Fragr. J., 2002, 17, 1, 69-71, https://doi.org/10.1002/ffj.1044 . [all data]

Schwob, Bessière, et al., 2002
Schwob, I.; Bessière, J.-M.; Viano, J., Composition of the essential oils of Hypericum perforatum L. from southeastern France, C.R. Acad. Sci. Ser. 3:, 2002, 325, 781-785. [all data]

Sefidkon, 2002
Sefidkon, F., Essential oil of Lantana camara L. occurring in Iran, Flavour Fragr. J., 2002, 17, 1, 78-80, https://doi.org/10.1002/ffj.1048 . [all data]

Velasco-Negueruela, Pérez-Alonso, et al., 2002
Velasco-Negueruela, A.; Pérez-Alonso, M.J.; Palá-Paúl, J.; Íñigo, A.; López, G., Leaf essential oils analysis of Juniperus navicularis Gandoger, Botanica Complutensis, 2002, 26, 85-91. [all data]

Zoghbi, Andrade, et al., 2002
Zoghbi, M.G.B.; Andrade, E.H.A.; da Silva, M.H.L.; Maia, J.G.S., Volatile constituents of Lippia lupulina Cham., Flavour Fragr. J., 2002, 17, 1, 29-31, https://doi.org/10.1002/ffj.1032 . [all data]

Zoghbi, Andrade, et al., 2002, 2
Zoghbi, M.G.B.; Andrade, E.H.A.; da Silva, M.H.; Maia, J.G.S.; Luz, A.I.R.; da Silva, J.D., Chemical variation in the essential oils of Hyptis crenata Pohl ex Benth., Flavour Fragr. J., 2002, 17, 1, 5-8, https://doi.org/10.1002/ffj.1031 . [all data]

Cornu, Carnat, et al., 2001
Cornu, A.; Carnat, A.-P.; Martin, B.; Coulon, J.-B.; Lamaison, J.-L.; Berdagué, J.-L., Solid-phase microextraction of volatile components from natural grassland plants, J. Agric. Food Chem., 2001, 49, 1, 203-209, https://doi.org/10.1021/jf0008341 . [all data]

Fernando and Grün, 2001
Fernando, L.N.; Grün, I.U., Headspace-SPME analysis of volatiles of the ridge gourd (Luffa acutangula) and bitter gourd (Momordica charantia) flowers, Flavour Fragr. J., 2001, 16, 4, 289-293, https://doi.org/10.1002/ffj.999 . [all data]

Flamini, Cioni, et al., 2001
Flamini, G.; Cioni, P.L.; Morelli, I.; Maccioni, S.; Monti, G., Composition of the essential oil of Teucrium fruticans L. from the Maremma Regional Park (Tuscany, Italy), Flavour Fragr. J., 2001, 16, 5, 367-369, https://doi.org/10.1002/ffj.1014 . [all data]

Gallori, Flamini, et al., 2001
Gallori, S.; Flamini, G.; Bilia, A.R.; Morelli, I.; Landini, A.; Vincieri, F.F., Chemical composition of some traditional herbal drug preparations: essential oil and aromatic water of costmary (Balsamita suaveolens Pers.), J. Agric. Food Chem., 2001, 49, 12, 5907-5910, https://doi.org/10.1021/jf0107656 . [all data]

Gupta, Mallavarapu, et al., 2001
Gupta, R.; Mallavarapu, G.R.; Banerjee, S.; Kumar, S., Characteristics of an isomenthone-rich somaclonal mutant isolated in a geraniol-rich rose-scented geranium accession of Pelargonium graveolens, Flavour Fragr. J., 2001, 16, 5, 319-324, https://doi.org/10.1002/ffj.1002 . [all data]

Jirovetz L., Buchbauer G., et al., 2001
Jirovetz L.; Buchbauer G.; Shafi P.M.; Rosamma M.K.; Geissler M., Analysis of the composition and aroma of the essential leaf oil of Syzygium travancoricum from South India by GC-FID, GC-MS, and olfactometry. Seasonal changes of composition, Chromatographia Sup., 2001, 53, S1, s372-s374, https://doi.org/10.1007/BF02490359 . [all data]

Lota, de Rocca Serra, et al., 2001
Lota, M.-L.; de Rocca Serra, D.; Tomi, F.; Casanova, J., Chemical variability of peel and leaf essential oils of 15 species of mandarins, Biochem. Syst. Ecol., 2001, 29, 1, 77-104, https://doi.org/10.1016/S0305-1978(00)00029-6 . [all data]

Marongiu, Porcedda, et al., 2001
Marongiu, B.; Porcedda, S.; Porta, G.D.; Reverchon, E., Extraction and isolation of Salvia desoleana and Mentha spicata subsp. insularis essential oils by supercritical CO2, Flavour Fragr. J., 2001, 16, 5, 384-388, https://doi.org/10.1002/ffj.1021 . [all data]

Mirza, Ahmadi, et al., 2001
Mirza, M.; Ahmadi, L.; Tayebi, M., Volatile constituents of Hymenocrater incanus Bunge, an Iranian endemic species, Flavour Fragr. J., 2001, 16, 4, 239-240, https://doi.org/10.1002/ffj.983 . [all data]

Orav, Kailas, et al., 2001
Orav, A.; Kailas, T.; Ivask, K., Volatile constituents of Matricaria recutita L. from Estonia, Proc. Est. Acad. Sci. Chem., 2001, 50, 39-45. [all data]

Orav and Kann, 2001
Orav, A.; Kann, J., Determination of peppermint and orange aroma compounds in food and beverages, Proc. Est. Acad. Sci. Chem., 2001, 50, 4, 217-225. [all data]

Palá-Paúl, Pérez-Alonso, et al., 2001
Palá-Paúl, J.; Pérez-Alonso, M.J.; Velasco-Negueruela, A.; Palá-Paúl, R.; Sanz, J.; Conejero, Fco., Seasonal variation in chemical constituents of Santolina rosmarinifolia L. ssp. rosmarinifolia, Biochem. Syst. Ecol., 2001, 29, 7, 663-672, https://doi.org/10.1016/S0305-1978(01)00032-1 . [all data]

Rouseff, Jella, et al., 2001
Rouseff, R.; Jella, P.; Bazemore, R.; Yang, J.-J., Aroma active internal standards for gas chromatography-olfactometry of grapefruit juices, Am. Chem. Soc. Symp. Ser., 2001, 782, 73-87. [all data]

Santos-Gomes and Fernandes-Ferreira, 2001
Santos-Gomes, P.C.; Fernandes-Ferreira, M., Organ- and season-dependent variation in the essential oil composition of Salvia officinalis L. cultivated at two different sites, J. Agric. Food Chem., 2001, 49, 6, 2908-2916, https://doi.org/10.1021/jf001102b . [all data]

Santos, Moreira, et al., 2001
Santos, P.R.; Moreira, D.L.; Guimaraes, E.F.; Kaplan, M.A.C., Essential oil analysis of 10 piperaceae species from the Brazilian Atlantic forest, Phytochemistry, 2001, 58, 4, 547-551, https://doi.org/10.1016/S0031-9422(01)00290-4 . [all data]

Tellez M., Estell R., et al., 2001
Tellez M.; Estell R.; Fredrickson E.; Powell J.; Wedge D.; Schrader K.; Kobaisy M., Extracts of Flourensia cernua (L): Volatile constituents and antifungal, antialgal, and antitermite bioactivities, J. Chem. Ecol., 2001, 27, 11, 2263-2273, https://doi.org/10.1023/A:1012283005014 . [all data]

Vijayanand, Rao, et al., 2001
Vijayanand, P.; Rao, L.J.M.; Narasimham, P., Volatile flavour components of jamun fruit (Syzygium cumini L), Flavour Fragr. J., 2001, 16, 1, 47-49, https://doi.org/10.1002/1099-1026(200101/02)16:1<47::AID-FFJ944>3.0.CO;2-L . [all data]

Fraternale, Giamperi, et al., 2000
Fraternale, D.; Giamperi, L.; Ricci, D.; Manunta, A., Composition of the essential oil of Peucedanum verticillare, Biochem. Syst. Ecol., 2000, 28, 2, 143-147, https://doi.org/10.1016/S0305-1978(99)00049-6 . [all data]

Jirovetz, Puschmann, et al., 2000
Jirovetz, L.; Puschmann, C.; Stojanova, A.; Metodiev, S.; Buchbauer, G., Analysis of the essential oil volatiles of Douglas fir (Pseudotsuga menziesii) from Bulgaria, Flavour Fragr. J., 2000, 15, 6, 434-437, https://doi.org/10.1002/1099-1026(200011/12)15:6<434::AID-FFJ935>3.0.CO;2-0 . [all data]

Maia, Zoghbi, et al., 2000
Maia, J.G.S.; Zoghbi, M.G.B.; Andrade, E.H.A.; da Silva, M.H.L., Essential oils from Conobea scoparioides (Cham. Schltdl.) Benth., Flavour Fragr. J., 2000, 15, 6, 413-414, https://doi.org/10.1002/1099-1026(200011/12)15:6<413::AID-FFJ931>3.0.CO;2-H . [all data]

Mallavarapu, Rao, et al., 2000
Mallavarapu, G.R.; Rao, L.; Ramesh, S., Volatile constituents of the leaf and fruit oils of Murraya koenigii Spreng., L. Ess. Oil Res., 2000, 12, 6, 766-768, https://doi.org/10.1080/10412905.2000.9712211 . [all data]

Mitiku, Sawamura, et al., 2000
Mitiku, S.B.; Sawamura, M.; Itoh, T.; Ukeda, H., Volatile components of peel cold-pressed oils of two cultivars of sweet orange (Citrus sinensis (L.) Osbeck) from Ethiopia, Flavour Fragr. J., 2000, 15, 4, 240-244, https://doi.org/10.1002/1099-1026(200007/08)15:4<240::AID-FFJ902>3.0.CO;2-F . [all data]

Mohagheghzadeh, Shams-Ardakani, et al., 2000
Mohagheghzadeh, A.; Shams-Ardakani, M.; Ghannadi, A., Linalol-rich essential oil of Zataria multiflora Boiss. (Lamiaceae), Flavour Fragr. J., 2000, 15, 2, 119-122, https://doi.org/10.1002/(SICI)1099-1026(200003/04)15:2<119::AID-FFJ878>3.0.CO;2-V . [all data]

Mohagheghzadeh, Shams-Ardakani, et al., 2000, 2
Mohagheghzadeh, A.; Shams-Ardakani, M.; Ghannadi, A., Volatile constituents of callus and flower-bearing tops of Zataria multiflora Boiss. (Lamiaceae), Flavour Fragr. J., 2000, 15, 6, 373-376, https://doi.org/10.1002/1099-1026(200011/12)15:6<373::AID-FFJ923>3.0.CO;2-9 . [all data]

Senatore, Napolitano, et al., 2000
Senatore, F.; Napolitano, F.; Ozcan, M., Composition and antibacterial activity of the essential oil from Crithmum maritimum L. (Apiaceae) growing wild in Turkey, Flavour Fragr. J., 2000, 15, 3, 186-189, https://doi.org/10.1002/1099-1026(200005/06)15:3<186::AID-FFJ889>3.0.CO;2-I . [all data]

Tamura, Boonbumrung, et al., 2000
Tamura, H.; Boonbumrung, S.; Yoshizawa, T.; Varanyanond, W., Volatile components of the essential oil in the pulp of four yellow mangoes (Mangifera indica L.) in Thailand, Food Sci. Technol. Res., 2000, 6, 1, 68-73, https://doi.org/10.3136/fstr.6.68 . [all data]

Ali N.A.M. and Jantan, 1999
Ali N.A.M.; Jantan, I., Essential oil of cinnamomum tahijanum kost. from sarawak, ASEAN Review of BiodiversityEnvironment Conservation, 1999, November-December, 1-4. [all data]

Bicchi, Binello, et al., 1999
Bicchi, C.; Binello, A.; D'Amato, A.; Rubiolo, P., Reliability of Van den Dool retention indices in the analysis of essential oils, J. Chromatogr. Sci., 1999, 37, 8, 288-294, https://doi.org/10.1093/chromsci/37.8.288 . [all data]

Dzumayev, Tkachenko, et al., 1999
Dzumayev, Kh.K.; Tkachenko, K.G.; Tsibulskaya, I.A., Essential Oils of Origanum tytthanthum Gontsch. Produced from Plants Grown in Southern Uzbekistan, J. Essent. Oil Res., 1999, 11, 11, 593-598, https://doi.org/10.1080/10412905.1999.9701220 . [all data]

Kalemba, 1999
Kalemba, D., Constituents of the essential oil of Artemisia asiatica Nakai, Flavour Fragr. J., 1999, 14, 3, 173-176, https://doi.org/10.1002/(SICI)1099-1026(199905/06)14:3<173::AID-FFJ805>3.0.CO;2-Q . [all data]

Kuiate, Zollo, et al., 1999
Kuiate, J.-R.; Zollo, P.-H.A.; Nguefa, E.H.; Bessière, J.-M.; Lamaty, G.; Menut, C., Composition of the essential oils from the leaves of Microglossa pyrifolia (Lam.) O. Kuntze and Helichrysum odoratissimum (L.) Less. growing in Cameroon, Flavour Fragr. J., 1999, 14, 2, 82-84, https://doi.org/10.1002/(SICI)1099-1026(199903/04)14:2<82::AID-FFJ780>3.0.CO;2-Z . [all data]

Labuckas, Zygadlo, et al., 1999
Labuckas, D.O.; Zygadlo, J.A.; Faillaci, S.M.; Espinar, L.A., Constituents of the volatile oil of Porophyllum obscurum (Spreng.) D.C., Flavour Fragr. J., 1999, 14, 2, 107-108, https://doi.org/10.1002/(SICI)1099-1026(199903/04)14:2<107::AID-FFJ799>3.0.CO;2-E . [all data]

Lopes, Koketsu, et al., 1999
Lopes, D.; Koketsu, M.; Carauta, J.P.P.; de Oliveira, R.R.; Kaplan, M.A.C., Chemical composition of Pourouma guianensis Aublet essential oils, Flavour Fragr. J., 1999, 14, 4, 233-236, https://doi.org/10.1002/(SICI)1099-1026(199907/08)14:4<233::AID-FFJ813>3.0.CO;2-L . [all data]

Mohd and Jantan, 1999
Mohd, N.A.; Jantan, I., Essential oil of cinnamomum tahijanum Kost. from Sarawak, 1999, retrieved from http://www.arbec.com.my/pdf/art5novdec99.pdf. [all data]

Oberhofer, Nikiforov, et al., 1999
Oberhofer, B.; Nikiforov, A.; Buchbauer, G.; Jirovetz, L.; Bicchi, C., Investigation of the alteration of the composition of various essential oils used in aroma lamp applications, Flavour Fragr. J., 1999, 14, 5, 293-299, https://doi.org/10.1002/(SICI)1099-1026(199909/10)14:5<293::AID-FFJ829>3.0.CO;2-T . [all data]

Palá-Paúl, Pérez-Alonso, et al., 1999
Palá-Paúl, J.; Pérez-Alonso, M.J.; Velasco-Negueruela, A.; Ramos-Vázquez, P.; Gómez-Contreras, F.; Sanz, J., Essential oil of Santolina rosmarinifolia L. ssp. rosmarinifolia: first isolation of capillene, a diacetylene derivative, Flavour Fragr. J., 1999, 14, 2, 131-134, https://doi.org/10.1002/(SICI)1099-1026(199903/04)14:2<131::AID-FFJ794>3.0.CO;2-7 . [all data]

Pateira, Nogueira, et al., 1999
Pateira, L.; Nogueira, T.; Antunes, A.; Venancio, F.; Tavares, R.; Capelo, J., Two chemotypes of Crithmum maritimum L. from Portugal, Flavour Fragr. J., 1999, 14, 5, 333-343, https://doi.org/10.1002/(SICI)1099-1026(199909/10)14:5<333::AID-FFJ839>3.0.CO;2-V . [all data]

Porta, Porcedda, et al., 1999
Porta, G.D.; Porcedda, S.; Marongiu, B.; Reverchon, E., Isolation of eucalyptus oil by supercritical fluid extraction, Flavour Fragr. J., 1999, 14, 4, 214-218, https://doi.org/10.1002/(SICI)1099-1026(199907/08)14:4<214::AID-FFJ814>3.0.CO;2-H . [all data]

Prikhod'ko, Klyuev, et al., 1999
Prikhod'ko, A.B.; Klyuev, N.A.; Volkovich, S.V.; Emets, T.I.; Petrenko, V.V.; Dolya, E.V., Component composition od the essential oil of Thymus dimorphus, Chem. Nat. Comp., 1999, 35, 1, 46-51, https://doi.org/10.1007/BF02238208 . [all data]

Quiroz, Fuentes-Contreras, et al., 1999
Quiroz, A.; Fuentes-Contreras, E.; Ramírez, C.C.; Russell, G.B.; Niemeyer, H.M., Host-plant chemicals and distribution of Neuquenaphis ON Nothofagus, J. Chem. Ecol., 1999, 25, 5, 1043-1054, https://doi.org/10.1023/A:1020825707922 . [all data]

Rao, Bhattacharya, et al., 1999
Rao, B.R.R.; Bhattacharya, A.K.; Mallavarapu, G.R.; Ramesh, S., Volatile constituents of different parts of cornmint (Mentha arvensis L.), Flavour Fragr. J., 1999, 14, 5, 262-264, https://doi.org/10.1002/(SICI)1099-1026(199909/10)14:5<262::AID-FFJ766>3.0.CO;2-6 . [all data]

Sefidkon, Dabiri, et al., 1999
Sefidkon, F.; Dabiri, M.; Rahimi-Bidgoly, A., The effect of distillation methods and stage of plant growth on the essential oil content and composition of Thymus kotschyanus Boiss. Hohen, Flavour Fragr. J., 1999, 14, 6, 405-408, https://doi.org/10.1002/(SICI)1099-1026(199911/12)14:6<405::AID-FFJ853>3.0.CO;2-M . [all data]

Sefidkon and Khajavi, 1999
Sefidkon, F.; Khajavi, M.S., Chemical composition of the essential oils of two Salvia species from Iran: Salvia verticillata L. and Salvia santolinifolia Boiss., Flavour Fragr. J., 1999, 14, 2, 77-78, https://doi.org/10.1002/(SICI)1099-1026(199903/04)14:2<77::AID-FFJ726>3.0.CO;2-9 . [all data]

Sefidkon and Mirza, 1999
Sefidkon, F.; Mirza, M., Chemical composition of the essential oils of two Salvia species from Iran, Salvia virgata Jacq. and Salvia syriaca L., Flavour Fragr. J., 1999, 14, 1, 45-46, https://doi.org/10.1002/(SICI)1099-1026(199901/02)14:1<45::AID-FFJ774>3.0.CO;2-S . [all data]

Tellez, Canel, et al., 1999
Tellez, M.R.; Canel, C.; Rimando, A.M.; Duke, S.O., Differential accumulation of isoprenoids in glanded and glandless Artemisia annua L, Phytochemistry, 1999, 52, 6, 1035-1040, https://doi.org/10.1016/S0031-9422(99)00308-8 . [all data]

Tropnikova, Zenkevich, et al., 1999
Tropnikova, I.V.; Zenkevich, I.G.; Budantsev, A.L., Composition of Essential Oil Nepeta cataria L. var. Citriodora Beck and Features of its Determination, Rastit. Resursy (Rus.), 1999, 2, 64-69. [all data]

Zoghbi, Andrade, et al., 1999
Zoghbi, M.G.B.; Andrade, E.H.A.; Maia, J.G.S., The essential oil of Vitex angus-castus L. growing in the Amazon region, Flavour Fragr. J., 1999, 14, 4, 211-213, https://doi.org/10.1002/(SICI)1099-1026(199907/08)14:4<211::AID-FFJ812>3.0.CO;2-W . [all data]

Zoghbi, Andrade, et al., 1999, 2
Zoghbi, M.G.B.; Andrade, E.H.A.; Maia, J.G.S., Volatile constituents from leaves and flowers of Alpinia speciosa K. Schum. and A. purpurata (Viell.) Schum., Flavour Fragr. J., 1999, 14, 6, 411-414, https://doi.org/10.1002/(SICI)1099-1026(199911/12)14:6<411::AID-FFJ854>3.0.CO;2-U . [all data]

Doneanu and Anitescu, 1998
Doneanu, C.; Anitescu, G., Supercritical carbon dioxide extraction of Angelica archangelica L. root oil, J. Supercrit. Fluids, 1998, 12, 1, 59-67, https://doi.org/10.1016/S0896-8446(97)00040-5 . [all data]

Kökdil, Kurucu, et al., 1998
Kökdil, G.; Kurucu, S.; Yildiz, A., Essential oil composition of Nepeta nuda L. ssp. nuda, Flavour Fragr. J., 1998, 13, 4, 233-234, https://doi.org/10.1002/(SICI)1099-1026(1998070)13:4<233::AID-FFJ730>3.0.CO;2-7 . [all data]

Maia, Zohhbi, et al., 1998
Maia, J.G.S.; Zohhbi, M.G.B.; Andrade, E.H.A.; Santos, A.S.; da Silva, M.H.L.; Luz, A.I.R.; Bastos, C.N., Constituents of the essential oil of Piper aduncum L. growing wild in the Amazon region, Flavour Fragr. J., 1998, 13, 4, 269-272, https://doi.org/10.1002/(SICI)1099-1026(1998070)13:4<269::AID-FFJ744>3.0.CO;2-A . [all data]

Poiana, Sicari, et al., 1998
Poiana, M.; Sicari, V.; Mincione, B., Supercritical carbon dioxide (SC-CO2) extraction of grapefruit flavedo, Flavour Fragr. J., 1998, 13, 2, 125-130, https://doi.org/10.1002/(SICI)1099-1026(199803/04)13:2<125::AID-FFJ708>3.0.CO;2-# . [all data]

Stashenko, Cervantes, et al., 1998
Stashenko, E.E.; Cervantes, M.; Combariza, Y.; Martínez, J.R., HRGC-FID-MSD Analysis of the Secondary Metabolites Obtained by Different Extraction Methods from Lepechinia schiedeana, and Evaluation of its Antioxidant Activity in vitro in 20th International Symposium on Capillary Chromatography, 1998, 1-11. [all data]

Zollo, Biyiti, et al., 1998
Zollo, P.H.A.; Biyiti, L.; Tchoumbougnang, F.; Menut, C.; Lamaty, G.; Bouchet, Ph., Aromatic plants of tropical central Africa. Part XXXII. Chemical composition and antifungal activity of thirteen essential oils from aromatic plants of Cameroon, Flavour Fragr. J., 1998, 13, 2, 107-114, https://doi.org/10.1002/(SICI)1099-1026(199803/04)13:2<107::AID-FFJ701>3.0.CO;2-G . [all data]

Kökdil, Kurucu, et al., 1997
Kökdil, G.; Kurucu, S.; Topcu, G., Chemical constituents of the essential oils of Nepeta italica L. and Nepeta sulfuriflora P. H. Davis, Flavour Fragr. J., 1997, 12, 1, 33-35, https://doi.org/10.1002/(SICI)1099-1026(199701)12:1<33::AID-FFJ609>3.0.CO;2-V . [all data]

Mariaca, Berger, et al., 1997
Mariaca, R.G.; Berger, T.F.H.; Gauch, R.; Imhof, M.I.; Jeangros, B.; Bosset, J.O., Occurrence of volatile mono- and sesquiterpenoids in highland and lowland plant species as possible precursors for flavor compounds in milk and dairy products, J. Agric. Food Chem., 1997, 45, 11, 4423-4434, https://doi.org/10.1021/jf970216t . [all data]

Salgueiro, Vila, et al., 1997
Salgueiro, L.R.; Vila, R.; Tomi, F.; Figueiredo, A.C.; Barroso, J.G.; Cañigueral, S.; Casanova, J.; da Cunha, A.P.; Adzet, T., Variability of essential oils of Thymus caespititius from Portugal, Phytochemistry, 1997, 45, 2, 307-311, https://doi.org/10.1016/S0031-9422(96)00872-2 . [all data]

Tellez, Estell, et al., 1997
Tellez, M.R.; Estell, R.E.; Frederickson, E.L.; Havstad, K.M., Essntial oil of Flourensia cernua DC, J. Essent. Oil Res., 1997, 9, 6, 619-624, https://doi.org/10.1080/10412905.1997.9700799 . [all data]

Zunino, Novillo-Newton, et al., 1997
Zunino, M.P.; Novillo-Newton, M.; Maestri, D.M.; Zygadlo, J.A., Composition of the essential oil of Baccharis crispa Spreng. and Baccharis salicifolia Pers. grown in Cordoba (Argentina), Flavour Fragr. J., 1997, 12, 6, 405-407, https://doi.org/10.1002/(SICI)1099-1026(199711/12)12:6<405::AID-FFJ667>3.0.CO;2-R . [all data]

Ayedoun, Adeoti, et al., 1996
Ayedoun, A.M.; Adeoti, B.S.; Sossou, P.V.; Leclerq, P.A., Influence of fruit conservation methods on the essential oil composition of xylopia aethiopica (Dunal) A. Richard from Benin, Flavour Fragr. J., 1996, 11, 4, 245-250, https://doi.org/10.1002/(SICI)1099-1026(199607)11:4<245::AID-FFJ583>3.0.CO;2-K . [all data]

Chacko, Jayalekshmy, et al., 1996
Chacko, S.; Jayalekshmy, A.; Gopalakrishnan, M.; Narayanan, C.S., Roasting studies on black pepper (Piper nigrum L.), Flavour Fragr. J., 1996, 11, 5, 305-310, https://doi.org/10.1002/(SICI)1099-1026(199609)11:5<305::AID-FFJ588>3.0.CO;2-1 . [all data]

Gawdzik, Mardarowicz, et al., 1996
Gawdzik, J.; Mardarowicz, M.; Suprynowicz, Z.; Kawka, S.; Wolski, T., Supercritical fluid extraction of essential oils from the fruits of Archangelica off. Hoffm. and their characterization by GC/MS, J. Hi. Res. Chromatogr., 1996, 19, 4, 237-240, https://doi.org/10.1002/jhrc.1240190416 . [all data]

Orav, Kailas, et al., 1996
Orav, A.; Kailas, T.; Liiv, M., Analysis of terpenoic composition of conifer needle oils by steam distillation/extraction, gas chromatography and gas chromatography-mass spectrometry, Chromatographia, 1996, 43, 3/4, 215-219, https://doi.org/10.1007/BF02292955 . [all data]

Rajeswara, Kaul, et al., 1996
Rajeswara, B.R.; Kaul, P.N.; Bhattacharya, A.K.; Mallavarapu, G.R.; Ramesh, S., Yield and chemical composition of the essential oils of three Cymbopogon species suffering from iron chlorosis, Flavour Fragr. J., 1996, 11, 5, 289-293, https://doi.org/10.1002/(SICI)1099-1026(199609)11:5<289::AID-FFJ590>3.0.CO;2-7 . [all data]

Sagrero-Nieves and Bartley, 1996
Sagrero-Nieves, L.; Bartley, J.P., Volatile components from the leaves of heterotheca inuloides Cass., Flavour Fragr. J., 1996, 11, 1, 49-51, https://doi.org/10.1002/(SICI)1099-1026(199601)11:1<49::AID-FFJ538>3.0.CO;2-J . [all data]

Stashenko, Puertas, et al., 1996
Stashenko, E.E.; Puertas, M.A.; Combariza, M.Y., Volatile secondary metabolites from Spilanthes americana obtained by simultaneous steam distillation--solvent extraction and supercritical fluid extraction, J. Chromatogr. A, 1996, 752, 1-2, 223-232, https://doi.org/10.1016/S0021-9673(96)00480-3 . [all data]

Wong and Lai, 1996
Wong, K.C.; Lai, F.Y., Volatile constituents from the fruits of four Syzygium species grown in Malaysia, Flavour Fragr. J., 1996, 11, 1, 61-66, https://doi.org/10.1002/(SICI)1099-1026(199601)11:1<61::AID-FFJ539>3.0.CO;2-1 . [all data]

Dzumayev, Tsibulskaya, et al., 1995
Dzumayev, Kh.K.; Tsibulskaya, I.A.; Zenkevich, I.G.; Tkachenko, K.G.; Satzyperova, I.F., Essential Oils od Salvia Sclarea L. Produced from Plants Grown in Southern Uzbekistan, J. Essent. Oil Res., 1995, 7, 6, 597-604, https://doi.org/10.1080/10412905.1995.9700513 . [all data]

Stashenko, Torres, et al., 1995
Stashenko, E.E.; Torres, W.; Morales, J.R.M., A study of the compositional variation of the essential oil of ylang-ylang (Cananga odorata Hook Fil. et Thomson, forma genuina) during flower development, J. Hi. Res. Chromatogr., 1995, 18, 2, 101-104, https://doi.org/10.1002/jhrc.1240180206 . [all data]

Tirado, Stashenko, et al., 1995
Tirado, C.B.; Stashenko, E.E.; Combariza, M.Y.; Martinez, J.R., Comparative study of Colombian citrus oils by high-resolution gas chromatography and gas chromatography-mass spectrometry, J. Chromatogr. A, 1995, 697, 1-2, 501-513, https://doi.org/10.1016/0021-9673(94)00955-9 . [all data]

Demarne and van der Walt, 1993
Demarne, F.-E.; van der Walt, J.J.A., Composition of the Essential Oil of Pelargonium citronellum (Geraniaceae), J. Essent. Oil Res., 1993, 5, 3, 233-238, https://doi.org/10.1080/10412905.1993.9698214 . [all data]

Gopalakrishnan, Menon, et al., 1993
Gopalakrishnan, M.; Menon, N.; Padmakumari, K.P.; Jayalekshmy, A.; Narayanan, C.S., GC Analysis and Odor Profiles of Four New Indian Genotypes of Piper nigrum L., J. Essent. Oil Res., 1993, 5, 3, 247-253, https://doi.org/10.1080/10412905.1993.9698217 . [all data]

Mallavarapu, Ramesh, et al., 1993
Mallavarapu, G.R.; Ramesh, S.; Kaul, P.N.; Battacharya, A.K.; Rao, B.R.R., The essential oil of Hyptis suaveolens (L.) Poit., J. Essent. Oil Res., 1993, 5, 3, 321-323, https://doi.org/10.1080/10412905.1993.9698230 . [all data]

Kollmannsberger, Nitz, et al., 1992
Kollmannsberger, H.; Nitz, S.; Drawert, F., UBer die Aromastoffzusammensetzung von Hochdruckextrakten. I. Pfeffer (Piper nigrum, Var. muntok), Z. Lebensm. Unters Forsch., 1992, 194, 6, 545-551, https://doi.org/10.1007/BF01185481 . [all data]

Wyllie, Brophy, et al., 1990
Wyllie, S.G.; Brophy, J.J.; Sarafis, V.; Hobbs, M., Volatile Components of the Fruit of Pistacia Lentiscus, J. Food. Sci., 1990, 55, 5, 1325-1326, https://doi.org/10.1111/j.1365-2621.1990.tb03926.x . [all data]

Binder and Flath, 1989
Binder, R.G.; Flath, R.A., Volatile components of pineapple guava, J. Agric. Food Chem., 1989, 37, 3, 734-736, https://doi.org/10.1021/jf00087a034 . [all data]

Brophy, Davies, et al., 1989
Brophy, J.J.; Davies, N.W.; Southwell, I.A.; Stiff, I.A.; Williams, L.R., Gas chromatographic quality control for oil of Melaleuca terpinen-4-ol type (Australian tea tree), J. Agric. Food Chem., 1989, 37, 5, 1330-1335, https://doi.org/10.1021/jf00089a027 . [all data]

de Pooter, de Buyck, et al., 1989
de Pooter, H.L.; de Buyck, L.F.; Schamp, N.M.; Billiet, F.; De Bruyn, A., The volatile fraction of Otacanthus coeruleus Lindl. Containing the new copaene derivative β-copaen-4α-ol, Flavour Fragr. J., 1989, 4, 2, 47-51, https://doi.org/10.1002/ffj.2730040202 . [all data]

Takeoka and Butter, 1989
Takeoka, G.; Butter, R.G., Volatile constituents of pineapple (Ananas Comosus [L.] Merr.) in Flavor Chemistry. Trends and Developments, Teranishi,R.; Buttery,R.G.; Shahidi,F., ed(s)., American Chemical Society, Washington, DC, 1989, 223-237. [all data]

de Pooter, Nicolai, et al., 1988
de Pooter, H.L.; Nicolai, B.; De Laet, J.; De Buyck, L.F.; Schamp, N.M.; Goetghebeur, P., The Essential Oils of Five Nepeta Species. A Preliminary Evaluation of their Use in Chemotaxonomy by Cluster Analysis, Flavour Fragr. J., 1988, 3, 4, 155-159, https://doi.org/10.1002/ffj.2730030404 . [all data]

Wahab, Aboutabl, et al., 1987
Wahab, S.M.A.; Aboutabl, E.A.; El-Zalabani, S.M.; DePooter, H.L.; Al-Fallaha, B., The essential oil of olibanum, Planta Medica, 1987, 53, 04, 382-384, https://doi.org/10.1055/s-2006-962745 . [all data]

Buttery, Flath, et al., 1986
Buttery, R.G.; Flath, R.A.; Mon, T.R.; Ling, L.C., Identification of germacrene D in walnut and fig leaf volatiles, J. Agric. Food Chem., 1986, 34, 5, 820-822, https://doi.org/10.1021/jf00071a013 . [all data]

Nykanen, 1986
Nykanen, I., High Resolution Gas Chromatographic - Mass Spectrometric determination of the Flavour Composition of Wild Majoram (Origanum vulgare L.) Cultivated in Finland, Z. Lebensm Unters Forsch, 1986, 183, 4, 267-272, https://doi.org/10.1007/BF01087742 . [all data]

de Pooter, de Buyck, et al., 1986
de Pooter, H.L.; de Buyck, L.F.; Schamp, N.M.; Aboutabl, E.; De Bruyn, A.; Husain, S.Z., The Volatile Fraction of Senecio glaucus subsp. coronopifolius, Flavour Fragr. J., 1986, 1, 4-5, 159-163, https://doi.org/10.1002/ffj.2730010406 . [all data]

De Pooter and Schamp, 1986
De Pooter, H.L.; Schamp, N.M., Comparison of the Volatile Composition of Some Calamintha/Satureja Species, Prog. Essnt. Oil. Res., 1986, 139-150. [all data]

Buttery, Xu, et al., 1985
Buttery, R.G.; Xu, C.; Ling, L.C., Volatile components of wheat leaves (and stems): Possible insect attractants, J. Agric. Food Chem., 1985, 33, 1, 115-117, https://doi.org/10.1021/jf00061a033 . [all data]

Flath, Mon, et al., 1983
Flath, R.A.; Mon, T.R.; Lorenz, G.; Whitten, C.J.; Mackley, J.W., Volatile components of Acacia sp. blossoms, J. Agric. Food Chem., 1983, 31, 6, 1167-1170, https://doi.org/10.1021/jf00120a008 . [all data]