2-n-Heptylfuran

Kovats' RI, polar column, temperature ramp

Data compiled by: NIST Mass Spectrometry Data Center, William E. Wallace, director

Column type Capillary
Active phase DB-Wax
Column length (m) 60.
Carrier gas He
Substrate
Column diameter (mm) 0.25
Phase thickness (μm)
Tstart (C) 40.
Tend (C) 200.
Heat rate (K/min) 2.
Initial hold (min) 10.
Final hold (min)
I 1429.
ReferenceUmano and Shibamoto, 1987
Comment MSDC-RI

Van Den Dool and Kratz RI, polar column, temperature ramp

Data compiled by: NIST Mass Spectrometry Data Center, William E. Wallace, director

Column type CapillaryCapillaryCapillary
Active phase CP-WAX 57CBCP-WAX 57CBCP-WAX 57CB
Column length (m) 50.50.50.
Carrier gas  HeHe
Substrate
Column diameter (mm) 0.320.320.32
Phase thickness (μm)
Tstart (C) 60.60.60.
Tend (C) 200.200.200.
Heat rate (K/min) 4.4.4.
Initial hold (min) 5.5.5.
Final hold (min)  10.10.
I 1417.1416.1417.
ReferenceSalter L.J., Mottram D.S., et al., 1988Whitfield, Mottram, et al., 1988Whitfield, Mottram, et al., 1988
Comment MSDC-RI MSDC-RI MSDC-RI

Normal alkane RI, polar column, temperature ramp

Data compiled by: NIST Mass Spectrometry Data Center, William E. Wallace, director

Column type CapillaryCapillary
Active phase DB-WaxCarbowax 20M
Column length (m) 60.31.
Carrier gas  Helium
Substrate
Column diameter (mm) 0.250.50
Phase thickness (μm)
Tstart (C) 60.40.
Tend (C) 220.200.
Heat rate (K/min) 3.10.
Initial hold (min) 4.
Final hold (min)
I 1454.1416.
ReferenceChung, Eiserich, et al., 1993Labropoulos, Palmer, et al., 1982
Comment MSDC-RI MSDC-RI

Van Den Dool and Kratz RI, polar column, custom temperature program

Data compiled by: NIST Mass Spectrometry Data Center, William E. Wallace, director

Column type Capillary
Active phase CP-Wax 52CB
Column length (m) 50.
Carrier gas He
Substrate
Column diameter (mm) 0.25
Phase thickness (μm) 0.2
Program 33C(1.5min) => 1.5C/min => 60C(4min) => 2C/min => 100C => 8C/min => 220C(15min)
I 1417.
ReferenceKaack, Christensen, et al., 2005
Comment MSDC-RI

References

Umano and Shibamoto, 1987
Umano, K.; Shibamoto, T., Analysis of headspace volatiles from overheated beef fat, J. Agric. Food Chem., 1987, 35, 1, 14-18, https://doi.org/10.1021/jf00073a004 . [all data]