Diisopropyl selenide

Phase change data

Data compiled by: William E. Acree, Jr., James S. Chickos

Quantity Value Units Method Reference Comment
Δvap43.1 ± 1.0kJ/molCVoronkov, Klyuchnikov, et al., 1989

References

Voronkov, Klyuchnikov, et al., 1989
Voronkov, M.G.; Klyuchnikov, V.A.; Kolabin, S.N.; Shvets, G.N.; Varushin, P.I.; Deryagina, E.N.; Korchevin, N.A.; Tsvetnitskaya, S.I., Thermochemical properties of dialkyl chalcogenides and dichalcogenides RMnR (M = sulfur, selenium, tellurium; n = 1, 2), Dokl. Akad. Nauk SSSR, Phys. Chem., 1989, 307, 5, 1139. [all data]