6-Chloro-4-chromanone

Phase change data

Data compiled by: Thermodynamics Research Center, NIST Boulder Laboratories, Chris Muzny director

Quantity Value Units Method Reference Comment
Tfus236.3KN/AFerstandig, Butler, et al., 1954Uncertainty assigned by TRC = 1. K

In addition to the Thermodynamics Research Center (TRC) data available from this site, much more physical and chemical property data is available from the following TRC products:

References

Ferstandig, Butler, et al., 1954
Ferstandig, L.L.; Butler, J.C.; Strauss, A.E., J. Am. Chem. Soc., 1954, 76, 5779. [all data]