nonane, eicosafluoro-

Phase change data

Data compiled as indicated in comments:
TRC - Thermodynamics Research Center, NIST Boulder Laboratories, Chris Muzny director
AC - William E. Acree, Jr., James S. Chickos

Quantity Value Units Method Reference Comment
Tc524.0KN/AErmakov and Skripov, 1967Uncertainty assigned by TRC = 0.5 K; TRC
Quantity Value Units Method Reference Comment
Δvap45.3 ± 0.2kJ/molN/ADias, Gonçalves, et al., 2005Based on data from 288. - 333. K.; AC

Enthalpy of vaporization

ΔvapH (kJ/mol) Temperature (K) Method Reference Comment
32.8402.AStephenson and Malanowski, 1987Based on data from 387. - 524. K. See also Berman and West, 1967 and Dykyj, Svoboda, et al., 1999.; AC

In addition to the Thermodynamics Research Center (TRC) data available from this site, much more physical and chemical property data is available from the following TRC products:

References

Ermakov and Skripov, 1967
Ermakov, G.V.; Skripov, V.P., Saturation Line, Critical Parameters, and Attainable Superheating of the Perfluoroparaffins, Russ. J. Phys. Chem. (Engl. Transl.), 1967, 41, 39-43. [all data]

Dias, Gonçalves, et al., 2005
Dias, Ana M.A.; Gonçalves, Carla M.B.; Caço, Ana I.; Santos, Luís M.N.B.F.; Piñeiro, Manuel M.; Vega, Lourdes F.; Coutinho, João A.P.; Marrucho, Isabel M., Densities and Vapor Pressures of Highly Fluorinated Compounds, J. Chem. Eng. Data, 2005, 50, 4, 1328-1333, https://doi.org/10.1021/je050056e . [all data]

Stephenson and Malanowski, 1987
Stephenson, Richard M.; Malanowski, Stanislaw, Handbook of the Thermodynamics of Organic Compounds, 1987, https://doi.org/10.1007/978-94-009-3173-2 . [all data]

Berman and West, 1967
Berman, Horace A.; West, Estal Dale, Density and vapor pressure of nitromethane 26.degree. to 200.degree., J. Chem. Eng. Data, 1967, 12, 2, 197-199, https://doi.org/10.1021/je60033a011 . [all data]

Dykyj, Svoboda, et al., 1999
Dykyj, J.; Svoboda, J.; Wilhoit, R.C.; Frenkel, M.L.; Hall, K.R., Vapor Pressure of Chemicals: Part A. Vapor Pressure and Antoine Constants for Hydrocarbons and Sulfur, Selenium, Tellurium and Hydrogen Containing Organic Compounds, Springer, Berlin, 1999, 373. [all data]