Trichloroacetic acid, hexyl ester

Kovats' RI, non-polar column, isothermal

Data compiled by: NIST Mass Spectrometry Data Center, William E. Wallace, director

Column type CapillaryCapillaryCapillaryCapillaryCapillary
Active phase SE-30SE-30SE-30SE-30SE-30
Column length (m) 25.25.25.25.25.
Carrier gas N2N2N2N2N2
Substrate
Column diameter (mm) 0.330.330.330.330.33
Phase thickness (μm)
Temperature (C) 120.140.160.180.200.
I 1315.1350.1358.1361.1367.
ReferenceHaken and Korhonen, 1986Haken and Korhonen, 1986Haken and Korhonen, 1986Haken and Korhonen, 1986Haken and Korhonen, 1986
Comment MSDC-RI MSDC-RI MSDC-RI MSDC-RI MSDC-RI
Column type CapillaryCapillaryCapillaryCapillaryCapillary
Active phase SE-30SE-30SE-30OV-101OV-101
Column length (m) 25.25.25.15.15.
Carrier gas    N2N2
Substrate
Column diameter (mm) 0.220.220.220.220.22
Phase thickness (μm)
Temperature (C) 100.140.180.80.200.
I 1340.1359.1380.1339.71366.7
ReferenceHaken, Madden, et al., 1983Haken, Madden, et al., 1983Haken, Madden, et al., 1983Komárek, Hornová, et al., 1982Komárek, Hornová, et al., 1982
Comment MSDC-RI MSDC-RI MSDC-RI MSDC-RI MSDC-RI
Column type Packed
Active phase SE-30
Column length (m) 1.
Carrier gas N2
Substrate Chromaton N-AW-DMCS
Column diameter (mm)
Phase thickness (μm)
Temperature (C) 200.
I 1372.
ReferenceGolovkin, Smol'chenko, et al., 1980
Comment MSDC-RI

References

Haken and Korhonen, 1986
Haken, J.R.; Korhonen, I.O.O., Gas chromatography of homologous esters. XXXIII. Capillary chromatography of monochlorinated C1-C8 n-alkyl acetates, chloracetates, dichloroacetates and trichloroacetates, J. Chromatogr., 1986, 357, 253-271, https://doi.org/10.1016/S0021-9673(01)95828-5 . [all data]

Haken, Madden, et al., 1983
Haken, J.K.; Madden, B.G.; Korhonen, I.O.O., Gas chromatography of homologous esters. XX. Capillary column studies of alkyl acetates, chloroacetates, dichloroacetates and trichloroacetates, J. Chromatogr., 1983, 256, 221-229, https://doi.org/10.1016/S0021-9673(01)88235-2 . [all data]

Komárek, Hornová, et al., 1982
Komárek, K.; Hornová, L.; Churácek, J., Glass capillary gas chromatography of homologous series of esters. Separation of homologous series of esters of halogenated carboxylic acids on a glass capillary column with the non-polar stationary silicone phase OV-101, J. Chromatogr., 1982, 244, 1, 142-147, https://doi.org/10.1016/S0021-9673(00)80131-4 . [all data]

Golovkin, Smol'chenko, et al., 1980
Golovkin, G.V.; Smol'chenko, A.I.; Zotov, L.N.; Sazonov, S.E., Systems of gas-chromatographic retention indices for identifying pesticides by means of selective detectors, Zh. Anal. Khim., 1980, 35, 5, 651-655. [all data]