C12H2F9N

Reaction thermochemistry data

Data compiled by: John E. Bartmess

Individual Reactions

C12HF9N- + Hydrogen cation = C12H2F9N

By formula: C12HF9N- + H+ = C12H2F9N

Quantity Value Units Method Reference Comment
Δr1329. ± 8.4kJ/molIMREKoppel, Taft, et al., 1994gas phase

References

Koppel, Taft, et al., 1994
Koppel, I.A.; Taft, R.W.; Anvia, F.; Zhu, S.Z.; Hu, L.Q.; Sung, K.S.; Desmarteau, D.D.; Yagupolskii, L.M., The Gas-Phase Acidities of Very Strong Neutral Bronsted Acids, J. Am. Chem. Soc., 1994, 116, 7, 3047, https://doi.org/10.1021/ja00086a038 . [all data]