4,4'-[1,2-butanediylbis(oxy)]bis(benzoic acid)

Phase change data

Data compiled by: Thermodynamics Research Center, NIST Boulder Laboratories, Chris Muzny director

Quantity Value Units Method Reference Comment
Tfus612.7KN/AGriffin, Gorman, et al., 1984Uncertainty assigned by TRC = 0.5 K

In addition to the Thermodynamics Research Center (TRC) data available from this site, much more physical and chemical property data is available from the following TRC products:

References

Griffin, Gorman, et al., 1984
Griffin, A.C.; Gorman, S.; Hughes, W.E., Anal. Calorim., 1984, 5, 169. [all data]