Perfluoro(propylcyclohexane)

Phase change data

Data compiled by: William E. Acree, Jr., James S. Chickos

Quantity Value Units Method Reference Comment
Δvap43.1 ± 0.1kJ/molCVarushchenko, Druzhinina, et al., 1996
Δvap43.1 ± 0.5kJ/molEBVarushchenko, Bulgakova, et al., 1981
Δvap43.1 ± 0.1kJ/molCVarushchenko, Bulgakova, et al., 1981

Enthalpy of vaporization

ΔvapH (kJ/mol) Temperature (K) Reference Comment
40.4336.Dykyj, Svoboda, et al., 1999Based on data from 321. - 396. K.

References

Varushchenko, Druzhinina, et al., 1996
Varushchenko, Raisa M.; Druzhinina, Anna I.; Pashchenko, Larisa L., Thermodynamics of vaporization of some cyclic perfluorocarbons, Fluid Phase Equilibria, 1996, 126, 1, 93-104, https://doi.org/10.1016/S0378-3812(96)03111-1 . [all data]

Varushchenko, Bulgakova, et al., 1981
Varushchenko, R.M.; Bulgakova, L.L.; Minzabekyants, P.S.; Makarov, K.N., Russ. J. Phys. Chem., 1981, 55, 1480. [all data]

Dykyj, Svoboda, et al., 1999
Dykyj, J.; Svoboda, J.; Wilhoit, R.C.; Frenkel, M.L.; Hall, K.R., Vapor Pressure of Chemicals: Part A. Vapor Pressure and Antoine Constants for Hydrocarbons and Sulfur, Selenium, Tellurium and Hydrogen Containing Organic Compounds, Springer, Berlin, 1999, 373. [all data]