1,2,4,5-Tetrazine, 1,4-dihydro-3,6-dimethyl-

Gas phase ion energetics data

Data compiled by: Sharon G. Lias, John E. Bartmess, Joel F. Liebman, John L. Holmes, Rhoda D. Levin, and W. Gary Mallard

Ionization energy determinations

IE (eV) Method Reference Comment
7.85PEKaim, 1985Vertical value

References

Kaim, 1985
Kaim, W., Electronic structure of 1,4-dihydro-1,2,4,5-tetrazines and of related 1,4-dihydroaromatic compounds, J. Chem. Soc. Perkin Trans. 2, 1985, 1633. [all data]