2-methoxy-1,3,2-dioxaphospholane

Gas phase ion energetics data

Data evaluated as indicated in comments:
HL - Edward P. Hunter and Sharon G. Lias

Data compiled as indicated in comments:
LBLHLM - Sharon G. Lias, John E. Bartmess, Joel F. Liebman, John L. Holmes, Rhoda D. Levin, and W. Gary Mallard
LLK - Sharon G. Lias, Rhoda D. Levin, and Sherif A. Kafafi

Quantity Value Units Method Reference Comment
Proton affinity (review)895.1kJ/molN/AHunter and Lias, 1998HL
Quantity Value Units Method Reference Comment
Gas basicity862.7kJ/molN/AHunter and Lias, 1998HL

Ionization energy determinations

IE (eV) Method Reference Comment
9.1 ± 0.1PEHodges, Houle, et al., 1980LLK
9.65PEZverev, Bazhanova, et al., 1986Vertical value; LBLHLM
9.66PEWorley, Hargis, et al., 1982Vertical value; LBLHLM

References

Hunter and Lias, 1998
Hunter, E.P.; Lias, S.G., Evaluated Gas Phase Basicities and Proton Affinities of Molecules: An Update, J. Phys. Chem. Ref. Data, 1998, 27, 3, 413-656, https://doi.org/10.1063/1.556018 . [all data]

Hodges, Houle, et al., 1980
Hodges, R.V.; Houle, F.A.; Beauchamp, J.L.; Montag, R.A.; Verkade, J.G., Effects of molecular structure on basicity. Gas phase proton affinities of cyclic phosphites, J. Am. Chem. Soc., 1980, 102, 932. [all data]

Zverev, Bazhanova, et al., 1986
Zverev, V.V.; Bazhanova, Z.G.; Villem, N.V.; Villem, Y.Y.; Kitaev, Y.P., Photoelectron spectra and electronic structures of organophosphorus compounds., J. Gen. Chem. USSR, 1986, 56, 85. [all data]

Worley, Hargis, et al., 1982
Worley, S.D.; Hargis, J.H.; Chang, L.; Mattson, G.A.; Jennings, W.B., The UPS of some compounds containing the heteroatoms phosphorus, nitrogen and oxygen, J. Electron Spectrosc. Relat. Phenom., 1982, 25, 135. [all data]