N2H3+

Vibrational and/or electronic energy levels

Data compiled by: Marilyn E. Jacox

State:   X

Vib.
sym.
 No.   Approximate
 type of mode
 cm-1   Med.   Method   References

a' 4 N=N stretch 1570 ± 80 gas PI Ruscic and Berkowitz, 1991

Additional references: Jacox, 1994, page 236

References

Ruscic and Berkowitz, 1991
Ruscic, B.; Berkowitz, J., Photoionization mass spectrometric study of N2H2 and N2H3: N-H, N=N bond energies and proton affinity of N2, J. Chem. Phys., 1991, 95, 4378. [all data]

Jacox, 1994
Jacox, M.E., Vibrational and electronic energy levels of polyatomic transient molecules, American Chemical Society, Washington, DC, 1994, 464. [all data]