Phosphorus fluoride anion

Gas phase thermochemistry data

Data compiled as indicated in comments:
B - John E. Bartmess

Quantity Value Units Method Reference Comment
Δfgas-636. ± 50.kJ/molR-EAThynne, 1972From PF2NCS. G3MP2B3 calculations indicate an EA of ca. 0.75 eV.; B
Quantity Value Units Method Reference Comment
gas,1 bar257.36J/mol*KReviewChase, 1998Data last reviewed in June, 1977

References

Thynne, 1972
Thynne, J.C.J., Negative Ion Studies with a Time-of-Flight Mass Spectrometer., Dyn. Mass Spectrom., 1972, 3, 67. [all data]

Chase, 1998
Chase, M.W., Jr., NIST-JANAF Themochemical Tables, Fourth Edition, J. Phys. Chem. Ref. Data, Monograph 9, 1998, 1-1951. [all data]