bis(3-cyclopentadienyl)chlorohydrurozirconium

Condensed phase thermochemistry data

Data compiled by: José A. Martinho Simões

Quantity Value Units Method Reference Comment
Δfsolid-75.24 ± 0.93kcal/molReviewMartinho SimõesThe enthalpy of formation relies on -128.7 ± 0.79 kcal/mol for the enthalpy of formation of Zr(Cp)2(Cl)2(cr)

Reaction thermochemistry data

Data compiled by: José A. Martinho Simões

Individual Reactions

C10H11ClZr (cr) + Iodine (cr) = C10H10ClIZr (cr) + Hydrogen iodide (g)

By formula: C10H11ClZr (cr) + I2 (cr) = C10H10ClIZr (cr) + HI (g)

Quantity Value Units Method Reference Comment
Δr-18.7 ± 0.57kcal/molRSCDiogo, Simoni, et al., 1993

Phenol (cr) + C10H11ClZr (cr) = C16H15ClOZr (cr) + Hydrogen (g)

By formula: C6H6O (cr) + C10H11ClZr (cr) = C16H15ClOZr (cr) + H2 (g)

Quantity Value Units Method Reference Comment
Δr-18.6 ± 1.0kcal/molRSCDiogo, Simoni, et al., 1993

C10H11ClZr (cr) + Methyl Alcohol (l) = C11H13ClOZr (cr) + Hydrogen (g)

By formula: C10H11ClZr (cr) + CH4O (l) = C11H13ClOZr (cr) + H2 (g)

Quantity Value Units Method Reference Comment
Δr-19.4 ± 0.33kcal/molRSCDiogo, Simoni, et al., 1993

C10H11ClZr (cr) + Ethanol (l) = C12H15ClOZr (cr) + Hydrogen (g)

By formula: C10H11ClZr (cr) + C2H6O (l) = C12H15ClOZr (cr) + H2 (g)

Quantity Value Units Method Reference Comment
Δr-18.2 ± 0.31kcal/molRSCDiogo, Simoni, et al., 1993

C10H11ClZr (cr) + 1-Hexene (l) = C16H23ClZr (cr)

By formula: C10H11ClZr (cr) + C6H12 (l) = C16H23ClZr (cr)

Quantity Value Units Method Reference Comment
Δr-15.3 ± 0.98kcal/molRSCDiogo, Simoni, et al., 1993

References

Martinho Simões
Martinho Simões, J.A., Private communication (see http://webbook.nist.gov/chemistry/om/). [all data]

Diogo, Simoni, et al., 1993
Diogo, H.P.; Simoni, J.A.; Minas da Piedade, M.E.; Dias, A.R.; Martinho Simões, J.A., J. Am. Chem. Soc., 1993, 115, 2764. [all data]