Silicon monocarbide monophosphide

Gas phase ion energetics data

Data compiled by: Sharon G. Lias, Rhoda D. Levin, and Sherif A. Kafafi

Ionization energy determinations

IE (eV) Method Reference
8.9 ± 0.5EISmoes, Depiere, et al., 1972

References

Smoes, Depiere, et al., 1972
Smoes, S.; Depiere, D.; Drowart, J., The atomization energies of the gaseous molecules, Rev. Int. Hautes Temp. Refract., 1972, 9, 171. [all data]