1,1'-diadamantane

Kovats' RI, non-polar column, isothermal

View large format table.

Column type Active phase Temperature (C) I Reference Comment
CapillarySE-30190.2227.Sarkisova and Pimerzin, 2005He; Column length: 50. m; Column diameter: 0.2 mm
CapillarySE-30200.2245.Sarkisova and Pimerzin, 2005He; Column length: 50. m; Column diameter: 0.2 mm
CapillarySE-30210.2266.Sarkisova and Pimerzin, 2005He; Column length: 50. m; Column diameter: 0.2 mm
CapillarySE-30220.2286.Sarkisova and Pimerzin, 2005He; Column length: 50. m; Column diameter: 0.2 mm
CapillarySE-30230.2309.Sarkisova and Pimerzin, 2005He; Column length: 50. m; Column diameter: 0.2 mm

References

Sarkisova and Pimerzin, 2005
Sarkisova, V.S.; Pimerzin, A.A., Gas chromatographic characteristics and boiling points of diadamantanes, Pet. Chem. USSR (Engl. Transl.), 2005, 45, 1, 63-66. [all data]