Terephthalonitrile N,N'-dioxide

Phase change data

Data compiled as indicated in comments:
ALS - Hussein Y. Afeefy, Joel F. Liebman, and Stephen E. Stein
AC - William E. Acree, Jr., James S. Chickos

Quantity Value Units Method Reference Comment
Δsub73.0 ± 2.0kJ/molVAcree, Tucker, et al., 1992ALS
Δsub73.0 ± 2.0kJ/molMEAcree, Tucker, et al., 1992AC

References

Acree, Tucker, et al., 1992
Acree, W.E., Jr.; Tucker, S.A.; Pilcher, G., Enthalpies of combustion of 1,4-dicyanobenzene di-N-oxide and 1,4-dicyanobenzene: the mean dissociation enthalpy of the (N-O) bonds, J. Chem. Thermodyn., 1992, 24, 213-216. [all data]