Bis(η8-ethylcyclooctatetraene) uranium

Gas phase ion energetics data

Data compiled as indicated in comments:
LBLHLM - Sharon G. Lias, John E. Bartmess, Joel F. Liebman, John L. Holmes, Rhoda D. Levin, and W. Gary Mallard

Ionization energy determinations

IE (eV) Method Reference Comment
5.9PEGreen, Payne, et al., 1983LBLHLM
6.03PEGreen, Payne, et al., 1983Vertical value; LBLHLM

References

Green, Payne, et al., 1983
Green, C.; Payne, M.P.; Streitwieser, A., Jr., He I and He II photoelectron spectral studies of alkyluranocenes, Organometallics, 1983, 2, 1707. [all data]