Aluminum carbide

Gas phase thermochemistry data

Quantity Value Units Method Reference Comment
Δfgas689.52kJ/molReviewChase, 1998Data last reviewed in June, 1963
Quantity Value Units Method Reference Comment
gas,1 bar223.40J/mol*KReviewChase, 1998Data last reviewed in June, 1963

Gas Phase Heat Capacity (Shomate Equation)

Cp° = A + B*t + C*t2 + D*t3 + E/t2
H° − H°298.15= A*t + B*t2/2 + C*t3/3 + D*t4/4 − E/t + F − H
S° = A*ln(t) + B*t + C*t2/2 + D*t3/3 − E/(2*t2) + G
    Cp = heat capacity (J/mol*K)
    H° = standard enthalpy (kJ/mol)
    S° = standard entropy (J/mol*K)
    t = temperature (K) / 1000.

View plot Requires a JavaScript / HTML 5 canvas capable browser.

View table.

Temperature (K) 298. - 6000.
A 36.02169
B 1.621811
C -0.314770
D 0.026724
E -0.393205
F 677.3980
G 264.3150
H 689.5232
ReferenceChase, 1998
Comment Data last reviewed in June, 1963

References

Chase, 1998
Chase, M.W., Jr., NIST-JANAF Themochemical Tables, Fourth Edition, J. Phys. Chem. Ref. Data, Monograph 9, 1998, 1-1951. [all data]