cyclohexane, 1,2,3,4-tetramethyl-

Phase change data

Data compiled by: Thermodynamics Research Center, NIST Boulder Laboratories, Chris Muzny director

Quantity Value Units Method Reference Comment
Tboil448.2KN/ASmith and Pennekamp, 1945Uncertainty assigned by TRC = 2. K

In addition to the Thermodynamics Research Center (TRC) data available from this site, much more physical and chemical property data is available from the following TRC products:

References

Smith and Pennekamp, 1945
Smith, H.A.; Pennekamp, E.F.H., The Catalytic Hydrogenation of the Benzene Nucleus III. The Hydrogenation of Polymethylbenzenes, J. Am. Chem. Soc., 1945, 67, 279. [all data]