Bicyclo[5.1.0]octa-2,5-diene

Gas phase ion energetics data

Data compiled by: Henry M. Rosenstock, Keith Draxl, Bruce W. Steiner, and John T. Herron

Ionization energy determinations

IE (eV) Method Reference
8.43PEBischof, Gleiter, et al., 1970

References

Bischof, Gleiter, et al., 1970
Bischof, P.; Gleiter, R.; Heilbronner, E.; Hornung, V.; Schroder, G., The conjugative interaction between π-orbitals and Walsh-e-orbitals in bullvalene and related systems, Helv. Chim. Acta, 1970, 53, 1645. [all data]