Cyclohexane, fluoro-

Gas phase thermochemistry data

Data compiled by: Hussein Y. Afeefy, Joel F. Liebman, and Stephen E. Stein

Quantity Value Units Method Reference Comment
Δfgas-336.6 ± 1.1kJ/molCcrSchaffer, Verevkin, et al., 1997

Condensed phase thermochemistry data

Data compiled by: Hussein Y. Afeefy, Joel F. Liebman, and Stephen E. Stein

Quantity Value Units Method Reference Comment
Δfliquid-374.06 ± 0.84kJ/molCcrSchaffer, Verevkin, et al., 1997
Quantity Value Units Method Reference Comment
Δcliquid-3738.59 ± 0.84kJ/molCcrSchaffer, Verevkin, et al., 1997

Phase change data

Data compiled as indicated in comments:
TRC - Thermodynamics Research Center, NIST Boulder Laboratories, Chris Muzny director
ALS - Hussein Y. Afeefy, Joel F. Liebman, and Stephen E. Stein
AC - William E. Acree, Jr., James S. Chickos

Quantity Value Units Method Reference Comment
Tc667.93KN/AD'Souza and Teja, 1987Uncertainty assigned by TRC = 3. K; Ambrose's procedure; TRC
Quantity Value Units Method Reference Comment
Pc51.7259barN/AD'Souza and Teja, 1987Uncertainty assigned by TRC = 1.00 bar; Ambrose's procedure; TRC
Quantity Value Units Method Reference Comment
Δvap37.45 ± 0.73kJ/molVSchaffer, Verevkin, et al., 1997ALS
Δvap37.5 ± 0.3kJ/molGSSchaffer, Verevkin, et al., 1997Based on data from 271. - 301. K.; AC

Enthalpy of vaporization

ΔvapH (kJ/mol) Temperature (K) Method Reference Comment
35.0331.AStephenson and Malanowski, 1987Based on data from 316. - 373. K.; AC

Enthalpy of fusion

ΔfusH (kJ/mol) Temperature (K) Reference Comment
2.58285.3Gonthier-Vassal and Szwarc, 1986AC

In addition to the Thermodynamics Research Center (TRC) data available from this site, much more physical and chemical property data is available from the following TRC products:

Kovats' RI, non-polar column, isothermal

Data compiled by: NIST Mass Spectrometry Data Center, William E. Wallace, director

Column type PackedPacked
Active phase ApolaneApolane
Column length (m) 3.73.7
Carrier gas He
Substrate Chromosorb G AW DCMSChromosorb G AW DCMS
Column diameter (mm)
Phase thickness (μm)
Temperature (C) 150.150.
I 735.735.
ReferenceEvans and Haken, 1987Haken and Vernon, 1986
Comment MSDC-RI MSDC-RI

Normal alkane RI, non-polar column, custom temperature program

Data compiled by: NIST Mass Spectrometry Data Center, William E. Wallace, director

Column type Capillary
Active phase OV-1, SE-30, Methyl silicone, SP-2100, OV-101, DB-1, etc.
Column length (m) 50.
Carrier gas Hydrogen
Substrate
Column diameter (mm) 0.32
Phase thickness (μm)
Program not specified
I 738.
ReferenceWaggott and Davies, 1984
Comment MSDC-RI

References

Schaffer, Verevkin, et al., 1997
Schaffer, F.; Verevkin, S.P.; Rieger, H.J.; Beckhaus, H.D.; Ruchardt, C., Enthalpies of formation of a series of fluorinated hydrocarbons and strain-free group increments to assess polar and anomeric stabilization and strain, Liebigs Ann., 1997, 1333-1344. [all data]

D'Souza and Teja, 1987
D'Souza, R.; Teja, A.S., The prediction of the vapor pressures of carboxylic acids, Chem. Eng. Commun., 1987, 61, 13. [all data]

Stephenson and Malanowski, 1987
Stephenson, Richard M.; Malanowski, Stanislaw, Handbook of the Thermodynamics of Organic Compounds, 1987, https://doi.org/10.1007/978-94-009-3173-2 . [all data]

Gonthier-Vassal and Szwarc, 1986
Gonthier-Vassal, Anne; Szwarc, Henri, Glassy crystals. Glass transitions in crystalline fluoro-, cyano-, and isocyano-cyclohexane, Chemical Physics Letters, 1986, 129, 1, 5-8, https://doi.org/10.1016/0009-2614(86)80158-0 . [all data]