Butyric acid, dodecyl ester

Kovats' RI, non-polar column, isothermal

Data compiled by: NIST Mass Spectrometry Data Center, William E. Wallace, director

Column type CapillaryCapillaryCapillaryCapillaryCapillary
Active phase SE-30SE-30SE-30SE-30SE-30
Column length (m) 25.25.25.25.25.
Carrier gas N2N2N2N2N2
Substrate
Column diameter (mm) 0.330.330.330.330.33
Phase thickness (μm)
Temperature (C) 140.160.180.200.220.
I 1763.1765.1767.1768.1761.
ReferenceHaken and Korhonen, 1985Haken and Korhonen, 1985Haken and Korhonen, 1985Haken and Korhonen, 1985Haken and Korhonen, 1985
Comment MSDC-RI MSDC-RI MSDC-RI MSDC-RI MSDC-RI
Column type CapillaryPacked
Active phase OV-101SE-30
Column length (m) 15.2.
Carrier gas
Substrate  Chromosorb W
Column diameter (mm) 0.22
Phase thickness (μm)
Temperature (C) 200.180.
I 1771.1768.
ReferenceKomárek, Hornová, et al., 1983Zarazir, Chovin, et al., 1970
Comment MSDC-RI MSDC-RI

References

Haken and Korhonen, 1985
Haken, J.K.; Korhonen, I.O.O., Gas chromatography of homologous esters. XXVIII. Retention increments of aliphatic C1-C18 n-alkyl esters of butanoic acid and its monochloro derivatives on SE-30 and OV-351 capillary columns, J. Chromatogr., 1985, 320, 2, 325-334, https://doi.org/10.1016/S0021-9673(01)90510-2 . [all data]

Komárek, Hornová, et al., 1983
Komárek, K.; Hornová, L.; Horna, A.; Churácek, J., Glass capillary gas chromatography of homologous series of esters. III. Separation of alkyl halogenopropionates and halogenobutyrates on OV-101, J. Chromatogr., 1983, 262, 316-320, https://doi.org/10.1016/S0021-9673(01)88112-7 . [all data]

Zarazir, Chovin, et al., 1970
Zarazir, D.; Chovin, P.; Guiochon, G., Identification of hydroxylic compounds and their derivatives by gas chromatography, Chromatographia, 1970, 3, 4, 180-195, https://doi.org/10.1007/BF02269018 . [all data]