Lutetium tetracarbide

Gas phase ion energetics data

Data compiled by: Sharon G. Lias, Rhoda D. Levin, and Sherif A. Kafafi

Ionization energy determinations

IE (eV) Method Reference
11. ± 1.EIGuido, Balducci, et al., 1972

References

Guido, Balducci, et al., 1972
Guido, M.; Balducci, G.; De Maria, G., Thermodynamics of rare-earth-carbon systems. IV. The lutetium-carbon system, J. Chem. Phys., 1972, 57, 1475. [all data]