Ni2

Gas phase ion energetics data

Data compiled by: John E. Bartmess

Electron affinity determinations

EA (eV) Method Reference Comment
0.85 ± 0.10LPESLiu, Zhai, et al., 2002
0.926 ± 0.010LPESHo, Polak, et al., 1993

References

Liu, Zhai, et al., 2002
Liu, S.R.; Zhai, H.J.; Wang, L.S., Evolution of the electronic properties of small Ni-n(-) (n=1- 100) clusters by photoelectron spectroscopy, J. Chem. Phys., 2002, 117, 21, 9758-9765, https://doi.org/10.1063/1.1519008 . [all data]

Ho, Polak, et al., 1993
Ho, J.; Polak, M.L.; Ervin, K.M.; Lineberger, W.C., Photoelectron Spectroscopy of Nickel Group Dimers - Ni2(-), Pd2(-), and Pt2(-), J. Chem. Phys., 1993, 99, 11, 8542, https://doi.org/10.1063/1.465577 . [all data]