C2HF6N

Reaction thermochemistry data

Data compiled by: John E. Bartmess

Individual Reactions

C2F6N- + Hydrogen cation = C2HF6N

By formula: C2F6N- + H+ = C2HF6N

Quantity Value Units Method Reference Comment
Δr1357. ± 8.4kJ/molIMREKoppel, Taft, et al., 1994gas phase

Gas phase ion energetics data

Data compiled by: John E. Bartmess

De-protonation reactions

C2F6N- + Hydrogen cation = C2HF6N

By formula: C2F6N- + H+ = C2HF6N

Quantity Value Units Method Reference Comment
Δr1357. ± 8.4kJ/molIMREKoppel, Taft, et al., 1994gas phase

References

Koppel, Taft, et al., 1994
Koppel, I.A.; Taft, R.W.; Anvia, F.; Zhu, S.Z.; Hu, L.Q.; Sung, K.S.; Desmarteau, D.D.; Yagupolskii, L.M., The Gas-Phase Acidities of Very Strong Neutral Bronsted Acids, J. Am. Chem. Soc., 1994, 116, 7, 3047, https://doi.org/10.1021/ja00086a038 . [all data]