1-N-methylaminoadamantane

Kovats' RI, non-polar column, isothermal

View large format table.

Column type Active phase Temperature (C) I Reference Comment
PackedOV-101200.1387.Kurbatova, Yashkin, et al., 1999N2, Chromaton N-AW; Column length: 1. m
PackedApiezon L200.1345.Kurbatova, Yashkin, et al., 1999N2, Chromaton N-AW; Column length: 1. m
PackedOV-101200.1387.Kurbatova, Moiseev, et al., 1998Chromaton N-AW; Column length: 1. m
PackedApiezon L200.1345.Kurbatova, Moiseev, et al., 1998Chromaton N-AW; Column length: 1. m
CapillaryOV-101200.1391.Suslov, Rudenko, et al., 1988N2; Column length: 50. m; Column diameter: 0.25 mm

References

Kurbatova, Yashkin, et al., 1999
Kurbatova, S.V.; Yashkin, S.N.; Moiseev, I.K.; Zemtsova, M.N., A study of the cell effect for adamantane derivatives by gas-liquid chromatography, Russ. J. Phys. Chem. (Engl. Transl.), 1999, 73, 9, 1486-1489. [all data]

Kurbatova, Moiseev, et al., 1998
Kurbatova, S.V.; Moiseev, I.K.; Zemtsova, M.N.; Kudryashov, S.Yu., Gas chromatography of aminoadamantanes, J. Anal. Chem. USSR (Engl. Transl.), 1998, 53, 8, 732-734. [all data]

Suslov, Rudenko, et al., 1988
Suslov, I.A.; Rudenko, B.A.; Arzamastsev, A.P., Capillary chromatography of adamantane derivatives, Zh. Anal. Khim., 1988, 43, 328-332. [all data]