Diethylhydroxylamine

Gas phase thermochemistry data

Data compiled by: Hussein Y. Afeefy, Joel F. Liebman, and Stephen E. Stein

Quantity Value Units Method Reference Comment
Δfgas-121.77 ± 0.73kJ/molCcrSteele, Chirico, et al., 1990

Condensed phase thermochemistry data

Data compiled as indicated in comments:
ALS - Hussein Y. Afeefy, Joel F. Liebman, and Stephen E. Stein
DH - Eugene S. Domalski and Elizabeth D. Hearing

Quantity Value Units Method Reference Comment
Δfliquid-174.75 ± 0.72kJ/molCcrSteele, Chirico, et al., 1990ALS
Quantity Value Units Method Reference Comment
Δcliquid-2971.35 ± 0.66kJ/molCcrSteele, Chirico, et al., 1990ALS

Constant pressure heat capacity of liquid

Cp,liquid (J/mol*K) Temperature (K) Reference Comment
370.8298.15Steele, Chirico, et al., 1990DH

Phase change data

Data compiled as indicated in comments:
BS - Robert L. Brown and Stephen E. Stein
ALS - Hussein Y. Afeefy, Joel F. Liebman, and Stephen E. Stein

Quantity Value Units Method Reference Comment
Tboil400.7KN/AAldrich Chemical Company Inc., 1990BS
Tboil406.2KN/AWeast and Grasselli, 1989BS
Quantity Value Units Method Reference Comment
Δvap52.98 ± 0.12kJ/molVSteele, Chirico, et al., 1990ALS

Reaction thermochemistry data

Data compiled by: John E. Bartmess

Individual Reactions

C4H10NO- + Hydrogen cation = Diethylhydroxylamine

By formula: C4H10NO- + H+ = C4H11NO

Quantity Value Units Method Reference Comment
Δr1551. ± 8.8kJ/molG+TSBartmess, Basso, et al., 1983gas phase; See also Mahoney, Mendenhall, et al., 1973, Bordwell and Liu, 1996 for supporting DH values
Quantity Value Units Method Reference Comment
Δr1523. ± 8.4kJ/molIMREBartmess, Basso, et al., 1983gas phase; See also Mahoney, Mendenhall, et al., 1973, Bordwell and Liu, 1996 for supporting DH values

Gas phase ion energetics data

Data evaluated as indicated in comments:
HL - Edward P. Hunter and Sharon G. Lias

Data compiled as indicated in comments:
B - John E. Bartmess

Quantity Value Units Method Reference Comment
Proton affinity (review)914.7kJ/molN/AHunter and Lias, 1998HL
Quantity Value Units Method Reference Comment
Gas basicity882.2kJ/molN/AHunter and Lias, 1998HL

De-protonation reactions

C4H10NO- + Hydrogen cation = Diethylhydroxylamine

By formula: C4H10NO- + H+ = C4H11NO

Quantity Value Units Method Reference Comment
Δr1551. ± 8.8kJ/molG+TSBartmess, Basso, et al., 1983gas phase; See also Mahoney, Mendenhall, et al., 1973, Bordwell and Liu, 1996 for supporting DH values; B
Quantity Value Units Method Reference Comment
Δr1523. ± 8.4kJ/molIMREBartmess, Basso, et al., 1983gas phase; See also Mahoney, Mendenhall, et al., 1973, Bordwell and Liu, 1996 for supporting DH values; B

References

Steele, Chirico, et al., 1990
Steele, W.V.; Chirico, R.D.; Nguyen, A.; Hossenlopp, I.A.; Smith, N.K., Determination of ideal-gas enthalpies of formation for key compounds, Am. Inst. Chem. Eng. Symp. Ser. (AIChE Symp. Ser.), 1990, 138-154. [all data]

Aldrich Chemical Company Inc., 1990
Aldrich Chemical Company Inc., Catalog Handbook of Fine Chemicals, Aldrich Chemical Company, Inc., Milwaukee WI, 1990, 1. [all data]

Weast and Grasselli, 1989
CRC Handbook of Data on Organic Compounds, 2nd Editon, Weast,R.C and Grasselli, J.G., ed(s)., CRC Press, Inc., Boca Raton, FL, 1989, 1. [all data]

Bartmess, Basso, et al., 1983
Bartmess, J.E.; Basso, T.; eorgiadis, R.M., The electron affinity of a nitroxide radical, J. Phys. Chem., 1983, 87, 912. [all data]

Mahoney, Mendenhall, et al., 1973
Mahoney, L.R.; Mendenhall, G.D.; Ingold, K.U., Calorimetric and Equilibrium Studies on Some Stable Nitroxide and Iminoxy Radicals. Approximate O-H BDEs in Hydroxylamines and Oximes., J. Am. Chem. Soc., 1973, 95, 26, 8610, https://doi.org/10.1021/ja00807a018 . [all data]

Bordwell and Liu, 1996
Bordwell, F.G.; Liu, W.-Z., Solvent Effects on Homolytic Bond Dissociation Energies of Hydroxylic Acids, J. Am. Chem. Soc., 1996, 118, 44, 10819-10823, https://doi.org/10.1021/ja961469q . [all data]

Hunter and Lias, 1998
Hunter, E.P.; Lias, S.G., Evaluated Gas Phase Basicities and Proton Affinities of Molecules: An Update, J. Phys. Chem. Ref. Data, 1998, 27, 3, 413-656, https://doi.org/10.1063/1.556018 . [all data]