Platinum, [(1,2,5,6-η)-1,5-cyclooctadiene]bis(trifluoromethyl)-

Gas phase ion energetics data

Data compiled by: Sharon G. Lias and Joel F. Liebman

Ionization energy determinations

IE (eV) Method Reference Comment
9.00PEYang, Bancroft, et al., 1990Vertical value

References

Yang, Bancroft, et al., 1990
Yang, D.S.; Bancroft, M.; Puddephatt, R.J.; Tse, J.S., Electronic structure of square-planar cis-bis(trifluormethyl)platinum(II) complexes from UV photoelectron spectra and SCF-MS-Xa calculations, Inorg. Chem., 1990, 29, 2496. [all data]