Ethane, 2-chloro-1-(chlorofluoromethoxy)-1,1,2-trifluoro-

Phase change data

Data compiled by: William E. Acree, Jr., James S. Chickos

Quantity Value Units Method Reference Comment
Δvap37.5 ± 0.1kJ/molCMajer, Uchytilová, et al., 1984

Enthalpy of vaporization

ΔvapH (kJ/mol) Temperature (K) Method Reference
36.4 ± 0.1313.CMajer, Uchytilová, et al., 1984
35.3 ± 0.1328.CMajer, Uchytilová, et al., 1984
34.1 ± 0.1343.CMajer, Uchytilová, et al., 1984
32.9 ± 0.1353.CMajer, Uchytilová, et al., 1984

References

Majer, Uchytilová, et al., 1984
Majer, V.; Uchytilová, V.; Svoboda, V.; Posta, A., Enthalpies of vaporization and cohesive energies of 2-chloro-1,1,2-trifluoroethyl methyl ether, 2-chloro-1,1,2-trifluoroethyl isopropyl ether, 2-chloro-1,1,2-trifluoroethyl butyl ether, and 2-chloro-1,1,2-trifluoroethyl chlorofluoromethyl ether, The Journal of Chemical Thermodynamics, 1984, 16, 8, 761-766, https://doi.org/10.1016/0021-9614(84)90060-0 . [all data]