Hexahydro-1-(3-nitrobenzoyl)-1H-azepine (compound is called hexamethyleneimine m-nitro-benzoate in paper)

Phase change data

Data compiled by: William E. Acree, Jr., James S. Chickos

Enthalpy of sublimation

ΔsubH (kcal/mol) Temperature (K) Reference Comment
27.0315.Rozenfel'd, Polteva, et al., 1972Based on data from 310. - 321. K.

References

Rozenfel'd, Polteva, et al., 1972
Rozenfel'd, I.L.; Polteva, M.N.; Persiantseva, V.P., Investigation of the adsorption and determination of the heats of sublimation of volatile corrosion inhibitors, Russ Chem Bull, 1972, 21, 3, 690-692, https://doi.org/10.1007/BF00863256 . [all data]