2-Azabicyclo[2.2.2]oct-5-ene-2-carboxylic acid, ethyl ester

Gas phase ion energetics data

Data compiled as indicated in comments:
LLK - Sharon G. Lias, Rhoda D. Levin, and Sherif A. Kafafi

Ionization energy determinations

IE (eV) Method Reference Comment
8.0PECarnovale, Gan, et al., 1981LLK
8.52PECarnovale, Gan, et al., 1981Vertical value; LLK

References

Carnovale, Gan, et al., 1981
Carnovale, F.; Gan, R.-H.; Peel, J.B.; Holmes, A.B., Photoelectron spectroscopic studies of some 2-azabicyclo[2.2.2]octan-5-one and Bicyclo[2.2.2]octanone derivatives, J. Chem. Soc. Perkin Trans. 2, 1981, 7, 991. [all data]