Azulene, 1,2,3,5,6,7,8,8a-octahydro-1,4-dimethyl-7-(1-methylethenyl)-, [1S-(1α,7α,8aβ)]-

Van Den Dool and Kratz RI, non-polar column, custom temperature program

Data compiled by: NIST Mass Spectrometry Data Center, William E. Wallace, director

Column type CapillaryCapillaryCapillaryCapillaryCapillary
Active phase DB-5CBP-5SPB-1CBP-5CP Sil 8 CB
Column length (m) 30.30.50.50.60.
Carrier gas HeHe He
Substrate
Column diameter (mm) 0.250.250.250.250.25
Phase thickness (μm) 0.250.250.250.250.25
Program 40C(2min) => 4C/min => 220C => 20C/min => 280C60C => 3C/min => 246C => 10C/min => 270C (5min)70C(3min) => 4C/min => 120C => 8C/min => 250C60C(2min) => 3C/min => 240C => 10C/min => 280C(10min)0C => rapidly => 40C(8min) => 4C/min => 250C(10min)
I 1509.1506.1510.1491.1517.
ReferenceAndrade, Sampaio, et al., 2007Silva, Oliveira, et al., 2007Díaz-Maroto, Sánchez Palomo, et al., 2004Azevedo, Campos, et al., 2002Duckham, Dodson, et al., 2001
Comment MSDC-RI MSDC-RI MSDC-RI MSDC-RI MSDC-RI

Kovats' RI, non-polar column, custom temperature program

Data compiled by: NIST Mass Spectrometry Data Center, William E. Wallace, director

Column type Packed
Active phase SE-30
Column length (m) 6.1
Carrier gas He
Substrate Chromasorb W
Column diameter (mm)
Phase thickness (μm)
Program 150C (10min) => 15C/min => 200C(16min) => 10C/min => 240C
I 1525.
ReferenceMinyard, Tumlinson, et al., 1967
Comment MSDC-RI

Normal alkane RI, polar column, custom temperature program

Data compiled by: NIST Mass Spectrometry Data Center, William E. Wallace, director

Column type CapillaryCapillary
Active phase DB-WaxCarbowax 20M
Column length (m)
Carrier gas N2
Substrate
Column diameter (mm)
Phase thickness (μm)
Program not specifiednot specified
I 1642.1664.
ReferencePala-Paul, Perez-Alonso, et al., 2005Vinogradov, 2004
Comment MSDC-RI MSDC-RI

References

Andrade, Sampaio, et al., 2007
Andrade, M.S.; Sampaio, T.S.; Nogueira, P.C.L.; Ribeiro, A.S.; Bittrich, V.; Amaral, M.C.E., Volatile compounds of the leaves, flowers and fruits of Kielmeyera rugosa Choisy (Clusiaceae), Flavour Fragr. J., 2007, 22, 1, 49-52, https://doi.org/10.1002/ffj.1751 . [all data]

Silva, Oliveira, et al., 2007
Silva, F.G.; Oliveira, C.B.A.; Pinto, J.E.B.P.; Nascimento, V.E.; Santos, S.C.; Seraphin, J.C.; Ferri, P.H., Seasonal Variability in the Essential Oils of Wild and Cultivated Baccharis trimera, J. Braz. Chem. Soc., 2007, 18, 5, 990-997, https://doi.org/10.1590/S0103-50532007000500017 . [all data]

Díaz-Maroto, Sánchez Palomo, et al., 2004
Díaz-Maroto, M.C.; Sánchez Palomo, E.; Castro, L.; González Viñas, M.A.; Pérez-Coello, M.S., Changes produced in the aroma compounds and structural integrity of basil (Ocimum basilicum L) during drying, J. Sci. Food Agric., 2004, 84, 15, 2070-2076, https://doi.org/10.1002/jsfa.1921 . [all data]

Azevedo, Campos, et al., 2002
Azevedo, N.R.; Campos, I.F.P.; Ferreira, H.D.; Portes, T.A.; Seraphin, J.C.; de Paula, J.R.; Santos, S.C.; Ferri, P.H., Essential oil chemotypes in Hyptis suaveolens from Brazilian Cerrado, Biochem. Syst. Ecol., 2002, 30, 3, 205-216, https://doi.org/10.1016/S0305-1978(01)00075-8 . [all data]

Duckham, Dodson, et al., 2001
Duckham, S.C.; Dodson, A.T.; Bakker, J.; Ames, J.M., Volatile flavour components of baked potato flesh. A comparison of eleven potato cultivars, Nahrung/Food, 2001, 45, 5, 317-323, https://doi.org/10.1002/1521-3803(20011001)45:5<317::AID-FOOD317>3.0.CO;2-4 . [all data]